Page MenuHomeFreeBSD
Paste P359

multimedia/x265: built on 12.1 armv6
ActivePublic

Authored by jbeich on Feb 6 2020, 11:39 AM.
=>> Building multimedia/x265
build started at Fri Feb 7 09:56:29 -04 2020
port directory: /usr/ports/multimedia/x265
package name: x265-3.2.1_1
building for: FreeBSD 121armv6-default-job-01 12.1-RELEASE FreeBSD 12.1-RELEASE 1201000 arm
maintained by: mi@aldan.algebra.com
Makefile ident:
Poudriere version: 3.3.99.20191210
Host OSVERSION: 1300076
Jail OSVERSION: 1201000
Job Id: 01
---Begin Environment---
SHELL=/bin/csh
UNAME_p=armv6
UNAME_m=arm
ABI_FILE=/usr/lib/crt1.o
OSVERSION=1201000
UNAME_v=FreeBSD 12.1-RELEASE 1201000
UNAME_r=12.1-RELEASE
BLOCKSIZE=K
MAIL=/var/mail/root
WARNING_WAIT=0
STATUS=1
HOME=/root
PATH=/sbin:/bin:/usr/sbin:/usr/bin:/usr/local/sbin:/usr/local/bin:/root/bin
LOCALBASE=/usr/local
QEMU_EMULATING=1
USER=root
LIBEXECPREFIX=/usr/local/libexec/poudriere
POUDRIERE_VERSION=3.3.99.20191210
MASTERMNT=/poudriere/data/.m/121armv6-default/ref
DEV_WARNING_WAIT=0
POUDRIERE_BUILD_TYPE=bulk
PACKAGE_BUILDING=yes
SAVED_TERM=tmux-256color
GID=0
UID=0
PWD=/poudriere/data/.m/121armv6-default/ref/.p/pool
NO_WARNING_PKG_INSTALL_EOL=yes
P_PORTS_FEATURES=FLAVORS SELECTED_OPTIONS
MASTERNAME=121armv6-default
SCRIPTPREFIX=/usr/local/share/poudriere
OLDPWD=/poudriere/data/.m/121armv6-default/ref/.p
SCRIPTPATH=/usr/local/share/poudriere/bulk.sh
POUDRIEREPATH=/usr/local/bin/poudriere
---End Environment---
---Begin Poudriere Port Flags/Env---
PORT_FLAGS=
PKGENV=
FLAVOR=
DEPENDS_ARGS=
MAKE_ARGS=
---End Poudriere Port Flags/Env---
---Begin OPTIONS List---
===> The following configuration options are available for x265-3.2.1_1:
DEBUG=off: Enable debugging
OPTIMIZED_FLAGS=on: Enable O3 optimization
VMAF=off: Per frame and aggregate VMAF score
====> Options available for the multi PixelWidth: you have to choose at least one of them
HI8P=on: Enable 8-bit pixel-width (you, probably, want this)
HI10P=on: Enable 10-bit pixels (may break on i386)
HI12P=on: Enable 12-bit pixels (may break on i386)
===> Use 'make config' to modify these settings
---End OPTIONS List---
--MAINTAINER--
mi@aldan.algebra.com
--End MAINTAINER--
--CONFIGURE_ARGS--
--End CONFIGURE_ARGS--
--CONFIGURE_ENV--
XDG_DATA_HOME=/wrkdirs/usr/ports/multimedia/x265/work XDG_CONFIG_HOME=/wrkdirs/usr/ports/multimedia/x265/work HOME=/wrkdirs/usr/ports/multimedia/x265/work TMPDIR="/tmp" PATH=/wrkdirs/usr/ports/multimedia/x265/work/.bin:/sbin:/bin:/usr/sbin:/usr/bin:/usr/local/sbin:/usr/local/bin:/root/bin SHELL=/bin/sh CONFIG_SHELL=/bin/sh
--End CONFIGURE_ENV--
--MAKE_ENV--
XDG_DATA_HOME=/wrkdirs/usr/ports/multimedia/x265/work XDG_CONFIG_HOME=/wrkdirs/usr/ports/multimedia/x265/work HOME=/wrkdirs/usr/ports/multimedia/x265/work TMPDIR="/tmp" PATH=/wrkdirs/usr/ports/multimedia/x265/work/.bin:/sbin:/bin:/usr/sbin:/usr/bin:/usr/local/sbin:/usr/local/bin:/root/bin NO_PIE=yes MK_DEBUG_FILES=no MK_KERNEL_SYMBOLS=no SHELL=/bin/sh NO_LINT=YES DESTDIR=/wrkdirs/usr/ports/multimedia/x265/work/stage PREFIX=/usr/local LOCALBASE=/usr/local CC="/nxb-bin/usr/bin/cc" CFLAGS="-O2 -pipe -DNDEBUG -O3 -fstack-protector-strong -fno-strict-aliasing " CPP="/nxb-bin/usr/bin/cpp" CPPFLAGS="" LDFLAGS=" -fstack-protector-strong " LIBS="" CXX="/nxb-bin/usr/bin/c++" CXXFLAGS="-O2 -pipe -DNDEBUG -O3 -fstack-protector-strong -fno-strict-aliasing " MANPREFIX="/usr/local" BSD_INSTALL_PROGRAM="install -s -m 555" BSD_INSTALL_LIB="install -s -m 0644" BSD_INSTALL_SCRIPT="install -m 555" BSD_INSTALL_DATA="install -m 0644" BSD_INSTALL_MAN="install -m 444"
--End MAKE_ENV--
--PLIST_SUB--
DEBUG="@comment " NO_DEBUG="" HI10P="" NO_HI10P="@comment " HI12P="" NO_HI12P="@comment " HI8P="" NO_HI8P="@comment " OPTIMIZED_FLAGS="" NO_OPTIMIZED_FLAGS="@comment " VMAF="@comment " NO_VMAF="" CMAKE_BUILD_TYPE="release" OSREL=12.1 PREFIX=%D LOCALBASE=/usr/local RESETPREFIX=/usr/local LIB32DIR=lib DOCSDIR="share/doc/x265" EXAMPLESDIR="share/examples/x265" DATADIR="share/x265" WWWDIR="www/x265" ETCDIR="etc/x265"
--End PLIST_SUB--
--SUB_LIST--
DEBUG="@comment " NO_DEBUG="" HI10P="" NO_HI10P="@comment " HI12P="" NO_HI12P="@comment " HI8P="" NO_HI8P="@comment " OPTIMIZED_FLAGS="" NO_OPTIMIZED_FLAGS="@comment " VMAF="@comment " NO_VMAF="" PREFIX=/usr/local LOCALBASE=/usr/local DATADIR=/usr/local/share/x265 DOCSDIR=/usr/local/share/doc/x265 EXAMPLESDIR=/usr/local/share/examples/x265 WWWDIR=/usr/local/www/x265 ETCDIR=/usr/local/etc/x265
--End SUB_LIST--
---Begin make.conf---
DEV_WARNING_WAIT=0
#NO_IGNORE=
# Minimize TeX dependency
devel_doxygen_UNSET += DOCS LATEX
# Bootstrapping isn't necessary for modern compilers and prevents taking
# advantage of native-xtools. GCC < 6 aren't C++11-compatible while
# Clang >= 6 and GCC >= 6 default to C++14.
lang_gcc6_UNSET += BOOTSTRAP
lang_gcc7_UNSET += BOOTSTRAP
lang_gcc8_UNSET += BOOTSTRAP
lang_gcc9_UNSET += BOOTSTRAP
# Workaround GCC/qemu crashes
.if ${MACHINE:Marm*}
math_ceres-solver_UNSET += OPENMP
graphics_colmap_UNSET += OPENMP
.endif
.sinclude "/etc/make.nxb.conf"
USE_PACKAGE_DEPENDS=yes
BATCH=yes
WRKDIRPREFIX=/wrkdirs
PORTSDIR=/usr/ports
PACKAGES=/packages
DISTDIR=/distfiles
FORCE_PACKAGE=yes
PACKAGE_BUILDING=yes
PACKAGE_BUILDING_FLAVORS=yes
MACHINE=arm
MACHINE_ARCH=armv6
ARCH=${MACHINE_ARCH}
#### /usr/local/etc/poudriere.d/make.conf ####
DEV_WARNING_WAIT=0
#NO_IGNORE=
# Minimize TeX dependency
devel_doxygen_UNSET += DOCS LATEX
# Bootstrapping isn't necessary for modern compilers and prevents taking
# advantage of native-xtools. GCC < 6 aren't C++11-compatible while
# Clang >= 6 and GCC >= 6 default to C++14.
lang_gcc6_UNSET += BOOTSTRAP
lang_gcc7_UNSET += BOOTSTRAP
lang_gcc8_UNSET += BOOTSTRAP
lang_gcc9_UNSET += BOOTSTRAP
# Workaround GCC/qemu crashes
.if ${MACHINE:Marm*}
math_ceres-solver_UNSET += OPENMP
graphics_colmap_UNSET += OPENMP
.endif
#### /usr/ports/Mk/Scripts/ports_env.sh ####
_CCVERSION_9d218390=FreeBSD clang version 8.0.1 (tags/RELEASE_801/final 366581) (based on LLVM 8.0.1) Target: armv6-unknown-freebsd12.1-gnueabihf Thread model: posix InstalledDir: /nxb-bin/usr/bin
_ALTCCVERSION_9d218390=none
_CXXINTERNAL_9c45a5b1=FreeBSD clang version 8.0.1 (tags/RELEASE_801/final 366581) (based on LLVM 8.0.1) Target: armv6-unknown-freebsd12.1-gnueabihf Thread model: posix InstalledDir: /nxb-bin/usr/bin "/nxb-bin/usr/bin/ld" "--eh-frame-hdr" "-dynamic-linker" "/libexec/ld-elf.so.1" "--hash-style=both" "--enable-new-dtags" "-o" "a.out" "/usr/lib/crt1.o" "/usr/lib/crti.o" "/usr/lib/crtbegin.o" "-L/usr/lib" "/dev/null" "-lc++" "-lm" "-lgcc" "--as-needed" "-lgcc_s" "--no-as-needed" "-lc" "-lgcc" "--as-needed" "-lgcc_s" "--no-as-needed" "/usr/lib/crtend.o" "/usr/lib/crtn.o"
CC_OUTPUT_9d218390_58173849=yes
CC_OUTPUT_9d218390_9bdba57c=yes
CC_OUTPUT_9d218390_6a4fe7f5=yes
CC_OUTPUT_9d218390_6bcac02b=yes
CC_OUTPUT_9d218390_67d20829=yes
CC_OUTPUT_9d218390_bfa62e83=yes
CC_OUTPUT_9d218390_f0b4d593=yes
CC_OUTPUT_9d218390_308abb44=yes
CC_OUTPUT_9d218390_f00456e5=yes
CC_OUTPUT_9d218390_65ad290d=yes
CC_OUTPUT_9d218390_f2776b26=yes
CC_OUTPUT_9d218390_b2657cc3=yes
CC_OUTPUT_9d218390_380987f7=yes
CC_OUTPUT_9d218390_160933ec=yes
CC_OUTPUT_9d218390_fb62803b=yes
_OBJC_CCVERSION_9d218390=FreeBSD clang version 8.0.1 (tags/RELEASE_801/final 366581) (based on LLVM 8.0.1) Target: armv6-unknown-freebsd12.1-gnueabihf Thread model: posix InstalledDir: /nxb-bin/usr/bin
_OBJC_ALTCCVERSION_9d218390=none
ARCH=armv6
OPSYS=FreeBSD
_OSRELEASE=12.1-RELEASE
OSREL=12.1
OSVERSION=1201000
PYTHONBASE=/usr/local
_SMP_CPUS=8
CONFIGURE_MAX_CMD_LEN=524288
HAVE_PORTS_ENV=1
#### Misc Poudriere ####
---End make.conf---
---Begin make.nxb.conf---
CC=/nxb-bin/usr/bin/cc
CPP=/nxb-bin/usr/bin/cpp
CXX=/nxb-bin/usr/bin/c++
AS=/nxb-bin/usr/bin/as
NM=/nxb-bin/usr/bin/nm
LD=/nxb-bin/usr/bin/ld
OBJCOPY=/nxb-bin/usr/bin/objcopy
SIZE=/nxb-bin/usr/bin/size
STRIPBIN=/nxb-bin/usr/bin/strip
SED=/nxb-bin/usr/bin/sed
RANLIB=/nxb-bin/usr/bin/ranlib
YACC=/nxb-bin/usr/bin/yacc
MAKE=/nxb-bin/usr/bin/make
STRINGS=/nxb-bin/usr/bin/strings
AWK=/nxb-bin/usr/bin/awk
FLEX=/nxb-bin/usr/bin/flex
---End make.nxb.conf---
--Resource limits--
cpu time (seconds, -t) unlimited
file size (512-blocks, -f) unlimited
data seg size (kbytes, -d) 33554432
stack size (kbytes, -s) 524288
core file size (512-blocks, -c) unlimited
max memory size (kbytes, -m) unlimited
locked memory (kbytes, -l) unlimited
max user processes (-u) 63536
open files (-n) 1024
virtual mem size (kbytes, -v) unlimited
swap limit (kbytes, -w) unlimited
socket buffer size (bytes, -b) unlimited
pseudo-terminals (-p) unlimited
kqueues (-k) unlimited
umtx shared locks (-o) unlimited
--End resource limits--
=======================<phase: check-sanity >============================
/!\ x265-3.2.1_1: Makefile warnings, please consider fixing /!\
These options name have characters outside of [-_A-Z0-9]:
PixelWidth
===> License GPLv2+ accepted by the user
===========================================================================
=======================<phase: pkg-depends >============================
===> x265-3.2.1_1 depends on file: /usr/local/sbin/pkg - not found
===> Installing existing package /packages/All/pkg-1.12.0_1.txz
[121armv6-default-job-01] Installing pkg-1.12.0_1...
[121armv6-default-job-01] Extracting pkg-1.12.0_1: .......... done
===> x265-3.2.1_1 depends on file: /usr/local/sbin/pkg - found
===> Returning to build of x265-3.2.1_1
===========================================================================
=======================<phase: fetch-depends >============================
===========================================================================
=======================<phase: fetch >============================
===> License GPLv2+ accepted by the user
===> x265-3.2.1_1 depends on file: /usr/local/sbin/pkg - found
===> Fetching all distfiles required by x265-3.2.1_1 for building
===========================================================================
=======================<phase: checksum >============================
===> License GPLv2+ accepted by the user
===> x265-3.2.1_1 depends on file: /usr/local/sbin/pkg - found
===> Fetching all distfiles required by x265-3.2.1_1 for building
=> SHA256 Checksum OK for x265_3.2.1.tar.gz.
===========================================================================
=======================<phase: extract-depends>============================
===========================================================================
=======================<phase: extract >============================
===> License GPLv2+ accepted by the user
===> x265-3.2.1_1 depends on file: /usr/local/sbin/pkg - found
===> Fetching all distfiles required by x265-3.2.1_1 for building
===> Extracting for x265-3.2.1_1
=> SHA256 Checksum OK for x265_3.2.1.tar.gz.
===========================================================================
=======================<phase: patch-depends >============================
===========================================================================
=======================<phase: patch >============================
===> Patching for x265-3.2.1_1
===> Applying FreeBSD patches for x265-3.2.1_1
===========================================================================
=======================<phase: build-depends >============================
===> x265-3.2.1_1 depends on executable: nasm - not found
===> Installing existing package /packages/All/nasm-2.14.02,1.txz
pkg-static: Warning: Major OS version upgrade detected. Running "pkg bootstrap -f" recommended
[121armv6-default-job-01] Installing nasm-2.14.02,1...
[121armv6-default-job-01] Extracting nasm-2.14.02,1: .......... done
===> x265-3.2.1_1 depends on executable: nasm - found
===> Returning to build of x265-3.2.1_1
===> x265-3.2.1_1 depends on file: /usr/local/bin/cmake - not found
===> Installing existing package /packages/All/cmake-3.16.3.txz
pkg-static: Warning: Major OS version upgrade detected. Running "pkg bootstrap -f" recommended
[121armv6-default-job-01] Installing cmake-3.16.3...
[121armv6-default-job-01] `-- Installing curl-7.68.0...
[121armv6-default-job-01] | `-- Installing ca_root_nss-3.49.2...
[121armv6-default-job-01] | `-- Extracting ca_root_nss-3.49.2: ........ done
[121armv6-default-job-01] | `-- Installing libnghttp2-1.40.0...
[121armv6-default-job-01] | `-- Extracting libnghttp2-1.40.0: .......... done
[121armv6-default-job-01] `-- Extracting curl-7.68.0: .......... done
[121armv6-default-job-01] `-- Installing expat-2.2.8...
[121armv6-default-job-01] `-- Extracting expat-2.2.8: .......... done
[121armv6-default-job-01] `-- Installing jsoncpp-1.9.2...
[121armv6-default-job-01] `-- Extracting jsoncpp-1.9.2: .......... done
[121armv6-default-job-01] `-- Installing libarchive-3.4.0,1...
[121armv6-default-job-01] | `-- Installing liblz4-1.9.2_1,1...
[121armv6-default-job-01] | `-- Extracting liblz4-1.9.2_1,1: .......... done
[121armv6-default-job-01] | `-- Installing lzo2-2.10_1...
[121armv6-default-job-01] | `-- Extracting lzo2-2.10_1: .......... done
[121armv6-default-job-01] `-- Extracting libarchive-3.4.0,1: .......... done
[121armv6-default-job-01] `-- Installing libuv-1.34.2...
[121armv6-default-job-01] `-- Extracting libuv-1.34.2: .......... done
[121armv6-default-job-01] `-- Installing rhash-1.3.5...
[121armv6-default-job-01] `-- Extracting rhash-1.3.5: .......... done
[121armv6-default-job-01] Extracting cmake-3.16.3: .......... done
=====
Message from ca_root_nss-3.49.2:
--
FreeBSD does not, and can not warrant that the certification authorities
whose certificates are included in this package have in any way been
audited for trustworthiness or RFC 3647 compliance.
Assessment and verification of trust is the complete responsibility of the
system administrator.
This package installs symlinks to support root certificates discovery by
default for software that uses OpenSSL.
This enables SSL Certificate Verification by client software without manual
intervention.
If you prefer to do this manually, replace the following symlinks with
either an empty file or your site-local certificate bundle.
* /etc/ssl/cert.pem
* /usr/local/etc/ssl/cert.pem
* /usr/local/openssl/cert.pem
===> x265-3.2.1_1 depends on file: /usr/local/bin/cmake - found
===> Returning to build of x265-3.2.1_1
===> x265-3.2.1_1 depends on executable: ninja - not found
===> Installing existing package /packages/All/ninja-1.10.0,2.txz
pkg-static: Warning: Major OS version upgrade detected. Running "pkg bootstrap -f" recommended
[121armv6-default-job-01] Installing ninja-1.10.0,2...
[121armv6-default-job-01] `-- Installing python37-3.7.6...
[121armv6-default-job-01] | `-- Installing gettext-runtime-0.20.1...
[121armv6-default-job-01] | | `-- Installing indexinfo-0.3.1...
[121armv6-default-job-01] | | `-- Extracting indexinfo-0.3.1: .... done
[121armv6-default-job-01] | `-- Extracting gettext-runtime-0.20.1: .......... done
[121armv6-default-job-01] | `-- Installing libffi-3.2.1_3...
[121armv6-default-job-01] | `-- Extracting libffi-3.2.1_3: .......... done
[121armv6-default-job-01] | `-- Installing readline-8.0.1...
[121armv6-default-job-01] | `-- Extracting readline-8.0.1: .......... done
[121armv6-default-job-01] `-- Extracting python37-3.7.6: .......... done
[121armv6-default-job-01] Extracting ninja-1.10.0,2: ........ done
=====
Message from python37-3.7.6:
--
Note that some standard Python modules are provided as separate ports
as they require additional dependencies. They are available as:
py37-gdbm databases/py-gdbm@py37
py37-sqlite3 databases/py-sqlite3@py37
py37-tkinter x11-toolkits/py-tkinter@py37
===> x265-3.2.1_1 depends on executable: ninja - found
===> Returning to build of x265-3.2.1_1
===========================================================================
=======================<phase: lib-depends >============================
===========================================================================
=>> Recording filesystem state for prebuild... done
=======================<phase: configure >============================
===> x265-3.2.1_1 depends on executable: nasm - found
===> x265-3.2.1_1 depends on file: /usr/local/bin/cmake - found
===> x265-3.2.1_1 depends on executable: ninja - found
===> Configuring for x265-3.2.1_1
===> Performing out-of-source build
/bin/mkdir -p /wrkdirs/usr/ports/multimedia/x265/work/.build
-- cmake version 3.16.3
CMake Deprecation Warning at CMakeLists.txt:10 (cmake_policy):
The OLD behavior for policy CMP0025 will be removed from a future version
of CMake.
The cmake-policies(7) manual explains that the OLD behaviors of all
policies are deprecated and that a policy should be set to OLD only under
specific short-term circumstances. Projects should be ported to the NEW
behavior and not rely on setting a policy to OLD.
CMake Deprecation Warning at CMakeLists.txt:16 (cmake_policy):
The OLD behavior for policy CMP0054 will be removed from a future version
of CMake.
The cmake-policies(7) manual explains that the OLD behaviors of all
policies are deprecated and that a policy should be set to OLD only under
specific short-term circumstances. Projects should be ported to the NEW
behavior and not rely on setting a policy to OLD.
-- The C compiler identification is Clang 8.0.1
-- The CXX compiler identification is Clang 8.0.1
-- Check for working C compiler: /nxb-bin/usr/bin/cc
-- Check for working C compiler: /nxb-bin/usr/bin/cc -- works
-- Detecting C compiler ABI info
-- Detecting C compiler ABI info - done
-- Detecting C compile features
-- Detecting C compile features - done
-- Check for working CXX compiler: /nxb-bin/usr/bin/c++
-- Check for working CXX compiler: /nxb-bin/usr/bin/c++ -- works
-- Detecting CXX compiler ABI info
-- Detecting CXX compiler ABI info - done
-- Detecting CXX compile features
-- Detecting CXX compile features - done
-- CMAKE_SYSTEM_PROCESSOR value `armv6` is unknown
-- Please add this value near /wrkdirs/usr/ports/multimedia/x265/work/x265_3.2.1/source/CMakeLists.txt:78
-- Could NOT find NUMA (missing: NUMA_ROOT_DIR NUMA_INCLUDE_DIR NUMA_LIBRARY)
-- Looking for include file inttypes.h
-- Looking for include file inttypes.h - found
-- Performing Test CC_HAS_NO_STRICT_OVERFLOW
-- Performing Test CC_HAS_NO_STRICT_OVERFLOW - Success
-- Performing Test CC_HAS_NO_NARROWING
-- Performing Test CC_HAS_NO_NARROWING - Success
-- Performing Test CC_HAS_NO_ARRAY_BOUNDS
-- Performing Test CC_HAS_NO_ARRAY_BOUNDS - Success
-- Performing Test CC_HAS_FAST_MATH
-- Performing Test CC_HAS_FAST_MATH - Success
-- Performing Test CC_HAS_STACK_REALIGN
-- Performing Test CC_HAS_STACK_REALIGN - Success
-- Performing Test CC_HAS_FNO_EXCEPTIONS_FLAG
-- Performing Test CC_HAS_FNO_EXCEPTIONS_FLAG - Success
-- Found nasm: /usr/local/bin/nasm (found version "2.14.02")
-- x265 version 3.2.1+1-b5c86a64bbbe
-- Looking for strtok_r
-- Looking for strtok_r - found
-- Looking for include file getopt.h
-- Looking for include file getopt.h - found
-- Looking for __rdtsc
-- Looking for __rdtsc - not found
-- Configuring done
-- Generating done
CMake Warning:
Manually-specified variables were not used by the project:
CMAKE_COLOR_MAKEFILE
CMAKE_CXX_FLAGS_DEBUG
CMAKE_C_FLAGS_DEBUG
CMAKE_C_FLAGS_RELEASE
CMAKE_MODULE_LINKER_FLAGS
CMAKE_VERBOSE_MAKEFILE
THREADS_HAVE_PTHREAD_ARG
_END_CUSTOM_OPTIONS
-- Build files have been written to: /wrkdirs/usr/ports/multimedia/x265/work/.build
===========================================================================
=======================<phase: build >============================
===> Building for x265-3.2.1_1
---> Building the 10-bit library ---
/bin/mkdir -p /wrkdirs/usr/ports/multimedia/x265/work/x265_3.2.1/10bit
/usr/local/bin/cmake -S /wrkdirs/usr/ports/multimedia/x265/work/x265_3.2.1/source -B /wrkdirs/usr/ports/multimedia/x265/work/x265_3.2.1/10bit -DENABLE_PIC:BOOL=true -DCMAKE_C_COMPILER:STRING="/nxb-bin/usr/bin/cc" -DCMAKE_CXX_COMPILER:STRING="/nxb-bin/usr/bin/c++" -DCMAKE_C_FLAGS:STRING="-O2 -pipe -DNDEBUG -O3 -fstack-protector-strong -fno-strict-aliasing " -DCMAKE_C_FLAGS_DEBUG:STRING="-O2 -pipe -DNDEBUG -O3 -fstack-protector-strong -fno-strict-aliasing " -DCMAKE_C_FLAGS_RELEASE:STRING="-O2 -pipe -DNDEBUG -O3 -fstack-protector-strong -fno-strict-aliasing " -DCMAKE_CXX_FLAGS:STRING="-O2 -pipe -DNDEBUG -O3 -fstack-protector-strong -fno-strict-aliasing " -DCMAKE_CXX_FLAGS_DEBUG:STRING="-O2 -pipe -DNDEBUG -O3 -fstack-protector-strong -fno-strict-aliasing " -DCMAKE_CXX_FLAGS_RELEASE:STRING="-O2 -pipe -DNDEBUG -O3 -fstack-protector-strong -fno-strict-aliasing " -DCMAKE_EXE_LINKER_FLAGS:STRING=" -fstack-protector-strong " -DCMAKE_MODULE_LINKER_FLAGS:STRING=" -fstack-protector-strong " -DCMAKE_SHARED_LINKER_FLAGS:STRING=" -fstack-protector-strong " -DCMAKE_INSTALL_PREFIX:PATH="/usr/local" -DCMAKE_BUILD_TYPE:STRING="Release" -DTHREADS_HAVE_PTHREAD_ARG:BOOL=YES -DCMAKE_INSTALL_RPATH_USE_LINK_PATH=YES -DCMAKE_VERBOSE_MAKEFILE:BOOL=ON -DCMAKE_COLOR_MAKEFILE:BOOL=OFF -GNinja -DHIGH_BIT_DEPTH:BOOL=true -DMAIN10:BOOL=true -DENABLE_ASSEMBLY:BOOL=true -DEXPORT_C_API:BOOL=false -DENABLE_CLI=false
-- cmake version 3.16.3
CMake Deprecation Warning at CMakeLists.txt:10 (cmake_policy):
The OLD behavior for policy CMP0025 will be removed from a future version
of CMake.
The cmake-policies(7) manual explains that the OLD behaviors of all
policies are deprecated and that a policy should be set to OLD only under
specific short-term circumstances. Projects should be ported to the NEW
behavior and not rely on setting a policy to OLD.
CMake Deprecation Warning at CMakeLists.txt:16 (cmake_policy):
The OLD behavior for policy CMP0054 will be removed from a future version
of CMake.
The cmake-policies(7) manual explains that the OLD behaviors of all
policies are deprecated and that a policy should be set to OLD only under
specific short-term circumstances. Projects should be ported to the NEW
behavior and not rely on setting a policy to OLD.
-- The C compiler identification is Clang 8.0.1
-- The CXX compiler identification is Clang 8.0.1
-- Check for working C compiler: /nxb-bin/usr/bin/cc
-- Check for working C compiler: /nxb-bin/usr/bin/cc -- works
-- Detecting C compiler ABI info
-- Detecting C compiler ABI info - done
-- Detecting C compile features
-- Detecting C compile features - done
-- Check for working CXX compiler: /nxb-bin/usr/bin/c++
-- Check for working CXX compiler: /nxb-bin/usr/bin/c++ -- works
-- Detecting CXX compiler ABI info
-- Detecting CXX compiler ABI info - done
-- Detecting CXX compile features
-- Detecting CXX compile features - done
-- CMAKE_SYSTEM_PROCESSOR value `armv6` is unknown
-- Please add this value near /wrkdirs/usr/ports/multimedia/x265/work/x265_3.2.1/source/CMakeLists.txt:78
-- Could NOT find NUMA (missing: NUMA_ROOT_DIR NUMA_INCLUDE_DIR NUMA_LIBRARY)
-- Looking for include file inttypes.h
-- Looking for include file inttypes.h - found
-- Performing Test CC_HAS_NO_STRICT_OVERFLOW
-- Performing Test CC_HAS_NO_STRICT_OVERFLOW - Success
-- Performing Test CC_HAS_NO_NARROWING
-- Performing Test CC_HAS_NO_NARROWING - Success
-- Performing Test CC_HAS_NO_ARRAY_BOUNDS
-- Performing Test CC_HAS_NO_ARRAY_BOUNDS - Success
-- Performing Test CC_HAS_FAST_MATH
-- Performing Test CC_HAS_FAST_MATH - Success
-- Performing Test CC_HAS_STACK_REALIGN
-- Performing Test CC_HAS_STACK_REALIGN - Success
-- Performing Test CC_HAS_FNO_EXCEPTIONS_FLAG
-- Performing Test CC_HAS_FNO_EXCEPTIONS_FLAG - Success
-- Found nasm: /usr/local/bin/nasm (found version "2.14.02")
-- x265 version 3.2.1+1-b5c86a64bbbe
-- Looking for strtok_r
-- Looking for strtok_r - found
-- Configuring done
-- Generating done
CMake Warning:
Manually-specified variables were not used by the project:
CMAKE_COLOR_MAKEFILE
CMAKE_CXX_FLAGS_DEBUG
CMAKE_C_FLAGS_DEBUG
CMAKE_C_FLAGS_RELEASE
CMAKE_EXE_LINKER_FLAGS
CMAKE_MODULE_LINKER_FLAGS
CMAKE_VERBOSE_MAKEFILE
MAIN10
THREADS_HAVE_PTHREAD_ARG
-- Build files have been written to: /wrkdirs/usr/ports/multimedia/x265/work/x265_3.2.1/10bit
/usr/bin/env XDG_DATA_HOME=/wrkdirs/usr/ports/multimedia/x265/work XDG_CONFIG_HOME=/wrkdirs/usr/ports/multimedia/x265/work HOME=/wrkdirs/usr/ports/multimedia/x265/work TMPDIR="/tmp" PATH=/wrkdirs/usr/ports/multimedia/x265/work/.bin:/sbin:/bin:/usr/sbin:/usr/bin:/usr/local/sbin:/usr/local/bin:/nonexistent/bin NO_PIE=yes MK_DEBUG_FILES=no MK_KERNEL_SYMBOLS=no SHELL=/bin/sh NO_LINT=YES DESTDIR=/wrkdirs/usr/ports/multimedia/x265/work/stage PREFIX=/usr/local LOCALBASE=/usr/local CC="/nxb-bin/usr/bin/cc" CFLAGS="-O2 -pipe -DNDEBUG -O3 -fstack-protector-strong -fno-strict-aliasing " CPP="/nxb-bin/usr/bin/cpp" CPPFLAGS="" LDFLAGS=" -fstack-protector-strong " LIBS="" CXX="/nxb-bin/usr/bin/c++" CXXFLAGS="-O2 -pipe -DNDEBUG -O3 -fstack-protector-strong -fno-strict-aliasing " MANPREFIX="/usr/local" BSD_INSTALL_PROGRAM="install -s -m 555" BSD_INSTALL_LIB="install -s -m 0644" BSD_INSTALL_SCRIPT="install -m 555" BSD_INSTALL_DATA="install -m 0644" BSD_INSTALL_MAN="install -m 444" ninja -C /wrkdirs/usr/ports/multimedia/x265/work/x265_3.2.1/10bit -v
ninja: Entering directory `/wrkdirs/usr/ports/multimedia/x265/work/x265_3.2.1/10bit'
[1/51] /nxb-bin/usr/bin/c++ -DEXPORT_C_API=0 -DHAVE_INT_TYPES_H=1 -DHIGH_BIT_DEPTH=1 -DX265_DEPTH=10 -DX265_NS=x265_10bit -D__STDC_LIMIT_MACROS=1 -I/wrkdirs/usr/ports/multimedia/x265/work/x265_3.2.1/source/. -I/wrkdirs/usr/ports/multimedia/x265/work/x265_3.2.1/source/common -I/wrkdirs/usr/ports/multimedia/x265/work/x265_3.2.1/source/encoder -I. -O2 -pipe -DNDEBUG -O3 -fstack-protector-strong -fno-strict-aliasing -O2 -pipe -DNDEBUG -O3 -fstack-protector-strong -fno-strict-aliasing -Wall -Wextra -Wshadow -std=gnu++98 -fPIC -Wno-array-bounds -ffast-math -mstackrealign -fno-exceptions -MD -MT common/CMakeFiles/common.dir/constants.cpp.o -MF common/CMakeFiles/common.dir/constants.cpp.o.d -o common/CMakeFiles/common.dir/constants.cpp.o -c /wrkdirs/usr/ports/multimedia/x265/work/x265_3.2.1/source/common/constants.cpp
[2/51] /nxb-bin/usr/bin/c++ -DEXPORT_C_API=0 -DHAVE_INT_TYPES_H=1 -DHIGH_BIT_DEPTH=1 -DX265_DEPTH=10 -DX265_NS=x265_10bit -D__STDC_LIMIT_MACROS=1 -I/wrkdirs/usr/ports/multimedia/x265/work/x265_3.2.1/source/. -I/wrkdirs/usr/ports/multimedia/x265/work/x265_3.2.1/source/common -I/wrkdirs/usr/ports/multimedia/x265/work/x265_3.2.1/source/encoder -I. -O2 -pipe -DNDEBUG -O3 -fstack-protector-strong -fno-strict-aliasing -O2 -pipe -DNDEBUG -O3 -fstack-protector-strong -fno-strict-aliasing -Wall -Wextra -Wshadow -std=gnu++98 -fPIC -Wno-array-bounds -ffast-math -mstackrealign -fno-exceptions -Wno-narrowing -MD -MT common/CMakeFiles/common.dir/cpu.cpp.o -MF common/CMakeFiles/common.dir/cpu.cpp.o.d -o common/CMakeFiles/common.dir/cpu.cpp.o -c /wrkdirs/usr/ports/multimedia/x265/work/x265_3.2.1/source/common/cpu.cpp
/wrkdirs/usr/ports/multimedia/x265/work/x265_3.2.1/source/common/cpu.cpp:387:26: warning: unused parameter 'benableavx512' [-Wunused-parameter]
uint32_t cpu_detect(bool benableavx512)
^
/wrkdirs/usr/ports/multimedia/x265/work/x265_3.2.1/source/common/cpu.cpp:61:13: warning: unused variable 'enable512' [-Wunused-variable]
static bool enable512 = false;
^
2 warnings generated.
[3/51] /nxb-bin/usr/bin/c++ -DEXPORT_C_API=0 -DHAVE_INT_TYPES_H=1 -DHIGH_BIT_DEPTH=1 -DX265_DEPTH=10 -DX265_NS=x265_10bit -D__STDC_LIMIT_MACROS=1 -I/wrkdirs/usr/ports/multimedia/x265/work/x265_3.2.1/source/. -I/wrkdirs/usr/ports/multimedia/x265/work/x265_3.2.1/source/common -I/wrkdirs/usr/ports/multimedia/x265/work/x265_3.2.1/source/encoder -I. -O2 -pipe -DNDEBUG -O3 -fstack-protector-strong -fno-strict-aliasing -O2 -pipe -DNDEBUG -O3 -fstack-protector-strong -fno-strict-aliasing -Wall -Wextra -Wshadow -std=gnu++98 -fPIC -Wno-array-bounds -ffast-math -mstackrealign -fno-exceptions -MD -MT common/CMakeFiles/common.dir/loopfilter.cpp.o -MF common/CMakeFiles/common.dir/loopfilter.cpp.o.d -o common/CMakeFiles/common.dir/loopfilter.cpp.o -c /wrkdirs/usr/ports/multimedia/x265/work/x265_3.2.1/source/common/loopfilter.cpp
[4/51] /nxb-bin/usr/bin/c++ -DEXPORT_C_API=0 -DHAVE_INT_TYPES_H=1 -DHIGH_BIT_DEPTH=1 -DX265_DEPTH=10 -DX265_NS=x265_10bit -D__STDC_LIMIT_MACROS=1 -I/wrkdirs/usr/ports/multimedia/x265/work/x265_3.2.1/source/. -I/wrkdirs/usr/ports/multimedia/x265/work/x265_3.2.1/source/common -I/wrkdirs/usr/ports/multimedia/x265/work/x265_3.2.1/source/encoder -I. -O2 -pipe -DNDEBUG -O3 -fstack-protector-strong -fno-strict-aliasing -O2 -pipe -DNDEBUG -O3 -fstack-protector-strong -fno-strict-aliasing -Wall -Wextra -Wshadow -std=gnu++98 -fPIC -Wno-array-bounds -ffast-math -mstackrealign -fno-exceptions -DENABLE_ASSEMBLY=1 -MD -MT common/CMakeFiles/common.dir/primitives.cpp.o -MF common/CMakeFiles/common.dir/primitives.cpp.o.d -o common/CMakeFiles/common.dir/primitives.cpp.o -c /wrkdirs/usr/ports/multimedia/x265/work/x265_3.2.1/source/common/primitives.cpp
[5/51] /nxb-bin/usr/bin/c++ -DEXPORT_C_API=0 -DHAVE_INT_TYPES_H=1 -DHIGH_BIT_DEPTH=1 -DX265_DEPTH=10 -DX265_NS=x265_10bit -D__STDC_LIMIT_MACROS=1 -I/wrkdirs/usr/ports/multimedia/x265/work/x265_3.2.1/source/. -I/wrkdirs/usr/ports/multimedia/x265/work/x265_3.2.1/source/common -I/wrkdirs/usr/ports/multimedia/x265/work/x265_3.2.1/source/encoder -I. -O2 -pipe -DNDEBUG -O3 -fstack-protector-strong -fno-strict-aliasing -O2 -pipe -DNDEBUG -O3 -fstack-protector-strong -fno-strict-aliasing -Wall -Wextra -Wshadow -std=gnu++98 -fPIC -Wno-array-bounds -ffast-math -mstackrealign -fno-exceptions -MD -MT common/CMakeFiles/common.dir/lowpassdct.cpp.o -MF common/CMakeFiles/common.dir/lowpassdct.cpp.o.d -o common/CMakeFiles/common.dir/lowpassdct.cpp.o -c /wrkdirs/usr/ports/multimedia/x265/work/x265_3.2.1/source/common/lowpassdct.cpp
[6/51] /nxb-bin/usr/bin/c++ -DEXPORT_C_API=0 -DHAVE_INT_TYPES_H=1 -DHIGH_BIT_DEPTH=1 -DX265_DEPTH=10 -DX265_NS=x265_10bit -D__STDC_LIMIT_MACROS=1 -I/wrkdirs/usr/ports/multimedia/x265/work/x265_3.2.1/source/. -I/wrkdirs/usr/ports/multimedia/x265/work/x265_3.2.1/source/common -I/wrkdirs/usr/ports/multimedia/x265/work/x265_3.2.1/source/encoder -I. -O2 -pipe -DNDEBUG -O3 -fstack-protector-strong -fno-strict-aliasing -O2 -pipe -DNDEBUG -O3 -fstack-protector-strong -fno-strict-aliasing -Wall -Wextra -Wshadow -std=gnu++98 -fPIC -Wno-array-bounds -ffast-math -mstackrealign -fno-exceptions -MD -MT common/CMakeFiles/common.dir/yuv.cpp.o -MF common/CMakeFiles/common.dir/yuv.cpp.o.d -o common/CMakeFiles/common.dir/yuv.cpp.o -c /wrkdirs/usr/ports/multimedia/x265/work/x265_3.2.1/source/common/yuv.cpp
[7/51] /nxb-bin/usr/bin/c++ -DEXPORT_C_API=0 -DHAVE_INT_TYPES_H=1 -DHIGH_BIT_DEPTH=1 -DX265_DEPTH=10 -DX265_NS=x265_10bit -D__STDC_LIMIT_MACROS=1 -I/wrkdirs/usr/ports/multimedia/x265/work/x265_3.2.1/source/. -I/wrkdirs/usr/ports/multimedia/x265/work/x265_3.2.1/source/common -I/wrkdirs/usr/ports/multimedia/x265/work/x265_3.2.1/source/encoder -I. -O2 -pipe -DNDEBUG -O3 -fstack-protector-strong -fno-strict-aliasing -O2 -pipe -DNDEBUG -O3 -fstack-protector-strong -fno-strict-aliasing -Wall -Wextra -Wshadow -std=gnu++98 -fPIC -Wno-array-bounds -ffast-math -mstackrealign -fno-exceptions -MD -MT common/CMakeFiles/common.dir/wavefront.cpp.o -MF common/CMakeFiles/common.dir/wavefront.cpp.o.d -o common/CMakeFiles/common.dir/wavefront.cpp.o -c /wrkdirs/usr/ports/multimedia/x265/work/x265_3.2.1/source/common/wavefront.cpp
[8/51] /nxb-bin/usr/bin/c++ -DEXPORT_C_API=0 -DHAVE_INT_TYPES_H=1 -DHIGH_BIT_DEPTH=1 -DX265_DEPTH=10 -DX265_NS=x265_10bit -D__STDC_LIMIT_MACROS=1 -I/wrkdirs/usr/ports/multimedia/x265/work/x265_3.2.1/source/. -I/wrkdirs/usr/ports/multimedia/x265/work/x265_3.2.1/source/common -I/wrkdirs/usr/ports/multimedia/x265/work/x265_3.2.1/source/encoder -I. -O2 -pipe -DNDEBUG -O3 -fstack-protector-strong -fno-strict-aliasing -O2 -pipe -DNDEBUG -O3 -fstack-protector-strong -fno-strict-aliasing -Wall -Wextra -Wshadow -std=gnu++98 -fPIC -Wno-array-bounds -ffast-math -mstackrealign -fno-exceptions -DENABLE_ASSEMBLY=1 -MD -MT common/CMakeFiles/common.dir/threading.cpp.o -MF common/CMakeFiles/common.dir/threading.cpp.o.d -o common/CMakeFiles/common.dir/threading.cpp.o -c /wrkdirs/usr/ports/multimedia/x265/work/x265_3.2.1/source/common/threading.cpp
[9/51] /nxb-bin/usr/bin/c++ -DEXPORT_C_API=0 -DHAVE_INT_TYPES_H=1 -DHIGH_BIT_DEPTH=1 -DX265_DEPTH=10 -DX265_NS=x265_10bit -D__STDC_LIMIT_MACROS=1 -I/wrkdirs/usr/ports/multimedia/x265/work/x265_3.2.1/source/. -I/wrkdirs/usr/ports/multimedia/x265/work/x265_3.2.1/source/common -I/wrkdirs/usr/ports/multimedia/x265/work/x265_3.2.1/source/encoder -I. -O2 -pipe -DNDEBUG -O3 -fstack-protector-strong -fno-strict-aliasing -O2 -pipe -DNDEBUG -O3 -fstack-protector-strong -fno-strict-aliasing -Wall -Wextra -Wshadow -std=gnu++98 -fPIC -Wno-array-bounds -ffast-math -mstackrealign -fno-exceptions -MD -MT common/CMakeFiles/common.dir/threadpool.cpp.o -MF common/CMakeFiles/common.dir/threadpool.cpp.o.d -o common/CMakeFiles/common.dir/threadpool.cpp.o -c /wrkdirs/usr/ports/multimedia/x265/work/x265_3.2.1/source/common/threadpool.cpp
[10/51] /nxb-bin/usr/bin/c++ -DEXPORT_C_API=0 -DHAVE_INT_TYPES_H=1 -DHIGH_BIT_DEPTH=1 -DX265_DEPTH=10 -DX265_NS=x265_10bit -D__STDC_LIMIT_MACROS=1 -I/wrkdirs/usr/ports/multimedia/x265/work/x265_3.2.1/source/. -I/wrkdirs/usr/ports/multimedia/x265/work/x265_3.2.1/source/common -I/wrkdirs/usr/ports/multimedia/x265/work/x265_3.2.1/source/encoder -I. -O2 -pipe -DNDEBUG -O3 -fstack-protector-strong -fno-strict-aliasing -O2 -pipe -DNDEBUG -O3 -fstack-protector-strong -fno-strict-aliasing -Wall -Wextra -Wshadow -std=gnu++98 -fPIC -Wno-array-bounds -ffast-math -mstackrealign -fno-exceptions -DX265_VERSION=3.2.1+1-b5c86a64bbbe -DENABLE_ASSEMBLY=1 -MD -MT common/CMakeFiles/common.dir/version.cpp.o -MF common/CMakeFiles/common.dir/version.cpp.o.d -o common/CMakeFiles/common.dir/version.cpp.o -c /wrkdirs/usr/ports/multimedia/x265/work/x265_3.2.1/source/common/version.cpp
[11/51] /nxb-bin/usr/bin/c++ -DEXPORT_C_API=0 -DHAVE_INT_TYPES_H=1 -DHIGH_BIT_DEPTH=1 -DX265_DEPTH=10 -DX265_NS=x265_10bit -D__STDC_LIMIT_MACROS=1 -I/wrkdirs/usr/ports/multimedia/x265/work/x265_3.2.1/source/. -I/wrkdirs/usr/ports/multimedia/x265/work/x265_3.2.1/source/common -I/wrkdirs/usr/ports/multimedia/x265/work/x265_3.2.1/source/encoder -I. -O2 -pipe -DNDEBUG -O3 -fstack-protector-strong -fno-strict-aliasing -O2 -pipe -DNDEBUG -O3 -fstack-protector-strong -fno-strict-aliasing -Wall -Wextra -Wshadow -std=gnu++98 -fPIC -Wno-array-bounds -ffast-math -mstackrealign -fno-exceptions -MD -MT common/CMakeFiles/common.dir/md5.cpp.o -MF common/CMakeFiles/common.dir/md5.cpp.o.d -o common/CMakeFiles/common.dir/md5.cpp.o -c /wrkdirs/usr/ports/multimedia/x265/work/x265_3.2.1/source/common/md5.cpp
[12/51] /nxb-bin/usr/bin/c++ -DEXPORT_C_API=0 -DHAVE_INT_TYPES_H=1 -DHIGH_BIT_DEPTH=1 -DX265_DEPTH=10 -DX265_NS=x265_10bit -D__STDC_LIMIT_MACROS=1 -I/wrkdirs/usr/ports/multimedia/x265/work/x265_3.2.1/source/. -I/wrkdirs/usr/ports/multimedia/x265/work/x265_3.2.1/source/common -I/wrkdirs/usr/ports/multimedia/x265/work/x265_3.2.1/source/encoder -I. -O2 -pipe -DNDEBUG -O3 -fstack-protector-strong -fno-strict-aliasing -O2 -pipe -DNDEBUG -O3 -fstack-protector-strong -fno-strict-aliasing -Wall -Wextra -Wshadow -std=gnu++98 -fPIC -Wno-array-bounds -ffast-math -mstackrealign -fno-exceptions -MD -MT common/CMakeFiles/common.dir/intrapred.cpp.o -MF common/CMakeFiles/common.dir/intrapred.cpp.o.d -o common/CMakeFiles/common.dir/intrapred.cpp.o -c /wrkdirs/usr/ports/multimedia/x265/work/x265_3.2.1/source/common/intrapred.cpp
[13/51] /nxb-bin/usr/bin/c++ -DEXPORT_C_API=0 -DHAVE_INT_TYPES_H=1 -DHIGH_BIT_DEPTH=1 -DX265_DEPTH=10 -DX265_NS=x265_10bit -D__STDC_LIMIT_MACROS=1 -I/wrkdirs/usr/ports/multimedia/x265/work/x265_3.2.1/source/. -I/wrkdirs/usr/ports/multimedia/x265/work/x265_3.2.1/source/common -I/wrkdirs/usr/ports/multimedia/x265/work/x265_3.2.1/source/encoder -I. -O2 -pipe -DNDEBUG -O3 -fstack-protector-strong -fno-strict-aliasing -O2 -pipe -DNDEBUG -O3 -fstack-protector-strong -fno-strict-aliasing -Wall -Wextra -Wshadow -std=gnu++98 -fPIC -Wno-array-bounds -ffast-math -mstackrealign -fno-exceptions -MD -MT common/CMakeFiles/common.dir/bitstream.cpp.o -MF common/CMakeFiles/common.dir/bitstream.cpp.o.d -o common/CMakeFiles/common.dir/bitstream.cpp.o -c /wrkdirs/usr/ports/multimedia/x265/work/x265_3.2.1/source/common/bitstream.cpp
[14/51] /nxb-bin/usr/bin/c++ -DEXPORT_C_API=0 -DHAVE_INT_TYPES_H=1 -DHIGH_BIT_DEPTH=1 -DX265_DEPTH=10 -DX265_NS=x265_10bit -D__STDC_LIMIT_MACROS=1 -I/wrkdirs/usr/ports/multimedia/x265/work/x265_3.2.1/source/. -I/wrkdirs/usr/ports/multimedia/x265/work/x265_3.2.1/source/common -I/wrkdirs/usr/ports/multimedia/x265/work/x265_3.2.1/source/encoder -I. -O2 -pipe -DNDEBUG -O3 -fstack-protector-strong -fno-strict-aliasing -O2 -pipe -DNDEBUG -O3 -fstack-protector-strong -fno-strict-aliasing -Wall -Wextra -Wshadow -std=gnu++98 -fPIC -Wno-array-bounds -ffast-math -mstackrealign -fno-exceptions -MD -MT common/CMakeFiles/common.dir/shortyuv.cpp.o -MF common/CMakeFiles/common.dir/shortyuv.cpp.o.d -o common/CMakeFiles/common.dir/shortyuv.cpp.o -c /wrkdirs/usr/ports/multimedia/x265/work/x265_3.2.1/source/common/shortyuv.cpp
[15/51] /nxb-bin/usr/bin/c++ -DEXPORT_C_API=0 -DHAVE_INT_TYPES_H=1 -DHIGH_BIT_DEPTH=1 -DX265_DEPTH=10 -DX265_NS=x265_10bit -D__STDC_LIMIT_MACROS=1 -I/wrkdirs/usr/ports/multimedia/x265/work/x265_3.2.1/source/. -I/wrkdirs/usr/ports/multimedia/x265/work/x265_3.2.1/source/common -I/wrkdirs/usr/ports/multimedia/x265/work/x265_3.2.1/source/encoder -I. -O2 -pipe -DNDEBUG -O3 -fstack-protector-strong -fno-strict-aliasing -O2 -pipe -DNDEBUG -O3 -fstack-protector-strong -fno-strict-aliasing -Wall -Wextra -Wshadow -std=gnu++98 -fPIC -Wno-array-bounds -ffast-math -mstackrealign -fno-exceptions -MD -MT common/CMakeFiles/common.dir/common.cpp.o -MF common/CMakeFiles/common.dir/common.cpp.o.d -o common/CMakeFiles/common.dir/common.cpp.o -c /wrkdirs/usr/ports/multimedia/x265/work/x265_3.2.1/source/common/common.cpp
[16/51] /nxb-bin/usr/bin/c++ -DEXPORT_C_API=0 -DHAVE_INT_TYPES_H=1 -DHIGH_BIT_DEPTH=1 -DX265_DEPTH=10 -DX265_NS=x265_10bit -D__STDC_LIMIT_MACROS=1 -I/wrkdirs/usr/ports/multimedia/x265/work/x265_3.2.1/source/. -I/wrkdirs/usr/ports/multimedia/x265/work/x265_3.2.1/source/common -I/wrkdirs/usr/ports/multimedia/x265/work/x265_3.2.1/source/encoder -I. -O2 -pipe -DNDEBUG -O3 -fstack-protector-strong -fno-strict-aliasing -O2 -pipe -DNDEBUG -O3 -fstack-protector-strong -fno-strict-aliasing -Wall -Wextra -Wshadow -std=gnu++98 -fPIC -Wno-array-bounds -ffast-math -mstackrealign -fno-exceptions -MD -MT common/CMakeFiles/common.dir/frame.cpp.o -MF common/CMakeFiles/common.dir/frame.cpp.o.d -o common/CMakeFiles/common.dir/frame.cpp.o -c /wrkdirs/usr/ports/multimedia/x265/work/x265_3.2.1/source/common/frame.cpp
[17/51] /nxb-bin/usr/bin/c++ -DEXPORT_C_API=0 -DHAVE_INT_TYPES_H=1 -DHIGH_BIT_DEPTH=1 -DX265_DEPTH=10 -DX265_NS=x265_10bit -D__STDC_LIMIT_MACROS=1 -I/wrkdirs/usr/ports/multimedia/x265/work/x265_3.2.1/source/. -I/wrkdirs/usr/ports/multimedia/x265/work/x265_3.2.1/source/common -I/wrkdirs/usr/ports/multimedia/x265/work/x265_3.2.1/source/encoder -I. -O2 -pipe -DNDEBUG -O3 -fstack-protector-strong -fno-strict-aliasing -O2 -pipe -DNDEBUG -O3 -fstack-protector-strong -fno-strict-aliasing -Wall -Wextra -Wshadow -std=gnu++98 -fPIC -Wno-array-bounds -ffast-math -mstackrealign -fno-exceptions -MD -MT common/CMakeFiles/common.dir/framedata.cpp.o -MF common/CMakeFiles/common.dir/framedata.cpp.o.d -o common/CMakeFiles/common.dir/framedata.cpp.o -c /wrkdirs/usr/ports/multimedia/x265/work/x265_3.2.1/source/common/framedata.cpp
[18/51] /nxb-bin/usr/bin/c++ -DEXPORT_C_API=0 -DHAVE_INT_TYPES_H=1 -DHIGH_BIT_DEPTH=1 -DX265_DEPTH=10 -DX265_NS=x265_10bit -D__STDC_LIMIT_MACROS=1 -I/wrkdirs/usr/ports/multimedia/x265/work/x265_3.2.1/source/. -I/wrkdirs/usr/ports/multimedia/x265/work/x265_3.2.1/source/common -I/wrkdirs/usr/ports/multimedia/x265/work/x265_3.2.1/source/encoder -I. -O2 -pipe -DNDEBUG -O3 -fstack-protector-strong -fno-strict-aliasing -O2 -pipe -DNDEBUG -O3 -fstack-protector-strong -fno-strict-aliasing -Wall -Wextra -Wshadow -std=gnu++98 -fPIC -Wno-array-bounds -ffast-math -mstackrealign -fno-exceptions -MD -MT common/CMakeFiles/common.dir/dct.cpp.o -MF common/CMakeFiles/common.dir/dct.cpp.o.d -o common/CMakeFiles/common.dir/dct.cpp.o -c /wrkdirs/usr/ports/multimedia/x265/work/x265_3.2.1/source/common/dct.cpp
[19/51] /nxb-bin/usr/bin/c++ -DEXPORT_C_API=0 -DHAVE_INT_TYPES_H=1 -DHIGH_BIT_DEPTH=1 -DX265_DEPTH=10 -DX265_NS=x265_10bit -D__STDC_LIMIT_MACROS=1 -I/wrkdirs/usr/ports/multimedia/x265/work/x265_3.2.1/source/. -I/wrkdirs/usr/ports/multimedia/x265/work/x265_3.2.1/source/common -I/wrkdirs/usr/ports/multimedia/x265/work/x265_3.2.1/source/encoder -I. -O2 -pipe -DNDEBUG -O3 -fstack-protector-strong -fno-strict-aliasing -O2 -pipe -DNDEBUG -O3 -fstack-protector-strong -fno-strict-aliasing -Wall -Wextra -Wshadow -std=gnu++98 -fPIC -Wno-array-bounds -ffast-math -mstackrealign -fno-exceptions -MD -MT common/CMakeFiles/common.dir/picyuv.cpp.o -MF common/CMakeFiles/common.dir/picyuv.cpp.o.d -o common/CMakeFiles/common.dir/picyuv.cpp.o -c /wrkdirs/usr/ports/multimedia/x265/work/x265_3.2.1/source/common/picyuv.cpp
[20/51] /nxb-bin/usr/bin/c++ -DEXPORT_C_API=0 -DHAVE_INT_TYPES_H=1 -DHIGH_BIT_DEPTH=1 -DX265_DEPTH=10 -DX265_NS=x265_10bit -D__STDC_LIMIT_MACROS=1 -I/wrkdirs/usr/ports/multimedia/x265/work/x265_3.2.1/source/. -I/wrkdirs/usr/ports/multimedia/x265/work/x265_3.2.1/source/common -I/wrkdirs/usr/ports/multimedia/x265/work/x265_3.2.1/source/encoder -I. -O2 -pipe -DNDEBUG -O3 -fstack-protector-strong -fno-strict-aliasing -O2 -pipe -DNDEBUG -O3 -fstack-protector-strong -fno-strict-aliasing -Wall -Wextra -Wshadow -std=gnu++98 -fPIC -Wno-array-bounds -ffast-math -mstackrealign -fno-exceptions -MD -MT common/CMakeFiles/common.dir/piclist.cpp.o -MF common/CMakeFiles/common.dir/piclist.cpp.o.d -o common/CMakeFiles/common.dir/piclist.cpp.o -c /wrkdirs/usr/ports/multimedia/x265/work/x265_3.2.1/source/common/piclist.cpp
[21/51] /nxb-bin/usr/bin/c++ -DEXPORT_C_API=0 -DHAVE_INT_TYPES_H=1 -DHIGH_BIT_DEPTH=1 -DX265_DEPTH=10 -DX265_NS=x265_10bit -D__STDC_LIMIT_MACROS=1 -I/wrkdirs/usr/ports/multimedia/x265/work/x265_3.2.1/source/. -I/wrkdirs/usr/ports/multimedia/x265/work/x265_3.2.1/source/common -I/wrkdirs/usr/ports/multimedia/x265/work/x265_3.2.1/source/encoder -I. -O2 -pipe -DNDEBUG -O3 -fstack-protector-strong -fno-strict-aliasing -O2 -pipe -DNDEBUG -O3 -fstack-protector-strong -fno-strict-aliasing -Wall -Wextra -Wshadow -std=gnu++98 -fPIC -Wno-array-bounds -ffast-math -mstackrealign -fno-exceptions -MD -MT common/CMakeFiles/common.dir/lowres.cpp.o -MF common/CMakeFiles/common.dir/lowres.cpp.o.d -o common/CMakeFiles/common.dir/lowres.cpp.o -c /wrkdirs/usr/ports/multimedia/x265/work/x265_3.2.1/source/common/lowres.cpp
[22/51] /nxb-bin/usr/bin/c++ -DEXPORT_C_API=0 -DHAVE_INT_TYPES_H=1 -DHIGH_BIT_DEPTH=1 -DX265_DEPTH=10 -DX265_NS=x265_10bit -D__STDC_LIMIT_MACROS=1 -I/wrkdirs/usr/ports/multimedia/x265/work/x265_3.2.1/source/. -I/wrkdirs/usr/ports/multimedia/x265/work/x265_3.2.1/source/common -I/wrkdirs/usr/ports/multimedia/x265/work/x265_3.2.1/source/encoder -I. -O2 -pipe -DNDEBUG -O3 -fstack-protector-strong -fno-strict-aliasing -O2 -pipe -DNDEBUG -O3 -fstack-protector-strong -fno-strict-aliasing -Wall -Wextra -Wshadow -std=gnu++98 -fPIC -Wno-array-bounds -ffast-math -mstackrealign -fno-exceptions -MD -MT common/CMakeFiles/common.dir/slice.cpp.o -MF common/CMakeFiles/common.dir/slice.cpp.o.d -o common/CMakeFiles/common.dir/slice.cpp.o -c /wrkdirs/usr/ports/multimedia/x265/work/x265_3.2.1/source/common/slice.cpp
[23/51] /nxb-bin/usr/bin/c++ -DEXPORT_C_API=0 -DHAVE_INT_TYPES_H=1 -DHIGH_BIT_DEPTH=1 -DX265_DEPTH=10 -DX265_NS=x265_10bit -D__STDC_LIMIT_MACROS=1 -I/wrkdirs/usr/ports/multimedia/x265/work/x265_3.2.1/source/. -I/wrkdirs/usr/ports/multimedia/x265/work/x265_3.2.1/source/common -I/wrkdirs/usr/ports/multimedia/x265/work/x265_3.2.1/source/encoder -I. -O2 -pipe -DNDEBUG -O3 -fstack-protector-strong -fno-strict-aliasing -O2 -pipe -DNDEBUG -O3 -fstack-protector-strong -fno-strict-aliasing -Wall -Wextra -Wshadow -std=gnu++98 -fPIC -Wno-array-bounds -ffast-math -mstackrealign -fno-exceptions -MD -MT common/CMakeFiles/common.dir/predict.cpp.o -MF common/CMakeFiles/common.dir/predict.cpp.o.d -o common/CMakeFiles/common.dir/predict.cpp.o -c /wrkdirs/usr/ports/multimedia/x265/work/x265_3.2.1/source/common/predict.cpp
In file included from /wrkdirs/usr/ports/multimedia/x265/work/x265_3.2.1/source/common/predict.cpp:29:
In file included from /wrkdirs/usr/ports/multimedia/x265/work/x265_3.2.1/source/common/predict.h:30:
In file included from /wrkdirs/usr/ports/multimedia/x265/work/x265_3.2.1/source/common/quant.h:29:
/wrkdirs/usr/ports/multimedia/x265/work/x265_3.2.1/source/common/scalinglist.h:36:12: warning: declaration shadows a variable in namespace 'x265_10bit' [-Wshadow]
enum { NUM_SIZES = 4 }; // 4x4, 8x8, 16x16, 32x32
^
/wrkdirs/usr/ports/multimedia/x265/work/x265_3.2.1/source/common/cudata.h:51:5: note: previous declaration is here
NUM_SIZES
^
1 warning generated.
[24/51] /nxb-bin/usr/bin/c++ -DEXPORT_C_API=0 -DHAVE_INT_TYPES_H=1 -DHIGH_BIT_DEPTH=1 -DX265_DEPTH=10 -DX265_NS=x265_10bit -D__STDC_LIMIT_MACROS=1 -I/wrkdirs/usr/ports/multimedia/x265/work/x265_3.2.1/source/. -I/wrkdirs/usr/ports/multimedia/x265/work/x265_3.2.1/source/common -I/wrkdirs/usr/ports/multimedia/x265/work/x265_3.2.1/source/encoder -I. -O2 -pipe -DNDEBUG -O3 -fstack-protector-strong -fno-strict-aliasing -O2 -pipe -DNDEBUG -O3 -fstack-protector-strong -fno-strict-aliasing -Wall -Wextra -Wshadow -std=gnu++98 -fPIC -Wno-array-bounds -ffast-math -mstackrealign -fno-exceptions -MD -MT common/CMakeFiles/common.dir/cudata.cpp.o -MF common/CMakeFiles/common.dir/cudata.cpp.o.d -o common/CMakeFiles/common.dir/cudata.cpp.o -c /wrkdirs/usr/ports/multimedia/x265/work/x265_3.2.1/source/common/cudata.cpp
[25/51] /nxb-bin/usr/bin/c++ -DEXPORT_C_API=0 -DHAVE_INT_TYPES_H=1 -DHIGH_BIT_DEPTH=1 -DX265_DEPTH=10 -DX265_NS=x265_10bit -D__STDC_LIMIT_MACROS=1 -I/wrkdirs/usr/ports/multimedia/x265/work/x265_3.2.1/source/. -I/wrkdirs/usr/ports/multimedia/x265/work/x265_3.2.1/source/common -I/wrkdirs/usr/ports/multimedia/x265/work/x265_3.2.1/source/encoder -I. -O2 -pipe -DNDEBUG -O3 -fstack-protector-strong -fno-strict-aliasing -O2 -pipe -DNDEBUG -O3 -fstack-protector-strong -fno-strict-aliasing -Wall -Wextra -Wshadow -std=gnu++98 -fPIC -Wno-array-bounds -ffast-math -mstackrealign -fno-exceptions -MD -MT common/CMakeFiles/common.dir/scalinglist.cpp.o -MF common/CMakeFiles/common.dir/scalinglist.cpp.o.d -o common/CMakeFiles/common.dir/scalinglist.cpp.o -c /wrkdirs/usr/ports/multimedia/x265/work/x265_3.2.1/source/common/scalinglist.cpp
[26/51] /nxb-bin/usr/bin/c++ -DEXPORT_C_API=0 -DHAVE_INT_TYPES_H=1 -DHIGH_BIT_DEPTH=1 -DX265_DEPTH=10 -DX265_NS=x265_10bit -D__STDC_LIMIT_MACROS=1 -I/wrkdirs/usr/ports/multimedia/x265/work/x265_3.2.1/source/. -I/wrkdirs/usr/ports/multimedia/x265/work/x265_3.2.1/source/common -I/wrkdirs/usr/ports/multimedia/x265/work/x265_3.2.1/source/encoder -I. -O2 -pipe -DNDEBUG -O3 -fstack-protector-strong -fno-strict-aliasing -O2 -pipe -DNDEBUG -O3 -fstack-protector-strong -fno-strict-aliasing -Wall -Wextra -Wshadow -std=gnu++98 -fPIC -Wno-array-bounds -ffast-math -mstackrealign -fno-exceptions -MD -MT common/CMakeFiles/common.dir/deblock.cpp.o -MF common/CMakeFiles/common.dir/deblock.cpp.o.d -o common/CMakeFiles/common.dir/deblock.cpp.o -c /wrkdirs/usr/ports/multimedia/x265/work/x265_3.2.1/source/common/deblock.cpp
[27/51] /nxb-bin/usr/bin/c++ -DEXPORT_C_API=0 -DHAVE_INT_TYPES_H=1 -DHIGH_BIT_DEPTH=1 -DX265_DEPTH=10 -DX265_NS=x265_10bit -D__STDC_LIMIT_MACROS=1 -I/wrkdirs/usr/ports/multimedia/x265/work/x265_3.2.1/source/. -I/wrkdirs/usr/ports/multimedia/x265/work/x265_3.2.1/source/common -I/wrkdirs/usr/ports/multimedia/x265/work/x265_3.2.1/source/encoder -I. -O2 -pipe -DNDEBUG -O3 -fstack-protector-strong -fno-strict-aliasing -O2 -pipe -DNDEBUG -O3 -fstack-protector-strong -fno-strict-aliasing -Wall -Wextra -Wshadow -std=gnu++98 -fPIC -Wno-array-bounds -ffast-math -mstackrealign -fno-exceptions -DHAVE_STRTOK_R=1 -MD -MT common/CMakeFiles/common.dir/param.cpp.o -MF common/CMakeFiles/common.dir/param.cpp.o.d -o common/CMakeFiles/common.dir/param.cpp.o -c /wrkdirs/usr/ports/multimedia/x265/work/x265_3.2.1/source/common/param.cpp
[28/51] /nxb-bin/usr/bin/c++ -DEXPORT_C_API=0 -DHAVE_INT_TYPES_H=1 -DHIGH_BIT_DEPTH=1 -DX265_DEPTH=10 -DX265_NS=x265_10bit -D__STDC_LIMIT_MACROS=1 -I/wrkdirs/usr/ports/multimedia/x265/work/x265_3.2.1/source/. -I/wrkdirs/usr/ports/multimedia/x265/work/x265_3.2.1/source/common -I/wrkdirs/usr/ports/multimedia/x265/work/x265_3.2.1/source/encoder -I. -O2 -pipe -DNDEBUG -O3 -fstack-protector-strong -fno-strict-aliasing -O2 -pipe -DNDEBUG -O3 -fstack-protector-strong -fno-strict-aliasing -Wall -Wextra -Wshadow -std=gnu++98 -fPIC -Wno-array-bounds -ffast-math -mstackrealign -fno-exceptions -Wno-uninitialized -MD -MT encoder/CMakeFiles/encoder.dir/bitcost.cpp.o -MF encoder/CMakeFiles/encoder.dir/bitcost.cpp.o.d -o encoder/CMakeFiles/encoder.dir/bitcost.cpp.o -c /wrkdirs/usr/ports/multimedia/x265/work/x265_3.2.1/source/encoder/bitcost.cpp
[29/51] /nxb-bin/usr/bin/c++ -DEXPORT_C_API=0 -DHAVE_INT_TYPES_H=1 -DHIGH_BIT_DEPTH=1 -DX265_DEPTH=10 -DX265_NS=x265_10bit -D__STDC_LIMIT_MACROS=1 -I/wrkdirs/usr/ports/multimedia/x265/work/x265_3.2.1/source/. -I/wrkdirs/usr/ports/multimedia/x265/work/x265_3.2.1/source/common -I/wrkdirs/usr/ports/multimedia/x265/work/x265_3.2.1/source/encoder -I. -O2 -pipe -DNDEBUG -O3 -fstack-protector-strong -fno-strict-aliasing -O2 -pipe -DNDEBUG -O3 -fstack-protector-strong -fno-strict-aliasing -Wall -Wextra -Wshadow -std=gnu++98 -fPIC -Wno-array-bounds -ffast-math -mstackrealign -fno-exceptions -Wno-uninitialized -MD -MT encoder/CMakeFiles/encoder.dir/level.cpp.o -MF encoder/CMakeFiles/encoder.dir/level.cpp.o.d -o encoder/CMakeFiles/encoder.dir/level.cpp.o -c /wrkdirs/usr/ports/multimedia/x265/work/x265_3.2.1/source/encoder/level.cpp
[30/51] /nxb-bin/usr/bin/c++ -DEXPORT_C_API=0 -DHAVE_INT_TYPES_H=1 -DHIGH_BIT_DEPTH=1 -DX265_DEPTH=10 -DX265_NS=x265_10bit -D__STDC_LIMIT_MACROS=1 -I/wrkdirs/usr/ports/multimedia/x265/work/x265_3.2.1/source/. -I/wrkdirs/usr/ports/multimedia/x265/work/x265_3.2.1/source/common -I/wrkdirs/usr/ports/multimedia/x265/work/x265_3.2.1/source/encoder -I. -O2 -pipe -DNDEBUG -O3 -fstack-protector-strong -fno-strict-aliasing -O2 -pipe -DNDEBUG -O3 -fstack-protector-strong -fno-strict-aliasing -Wall -Wextra -Wshadow -std=gnu++98 -fPIC -Wno-array-bounds -ffast-math -mstackrealign -fno-exceptions -MD -MT common/CMakeFiles/common.dir/quant.cpp.o -MF common/CMakeFiles/common.dir/quant.cpp.o.d -o common/CMakeFiles/common.dir/quant.cpp.o -c /wrkdirs/usr/ports/multimedia/x265/work/x265_3.2.1/source/common/quant.cpp
[31/51] /nxb-bin/usr/bin/c++ -DEXPORT_C_API=0 -DHAVE_INT_TYPES_H=1 -DHIGH_BIT_DEPTH=1 -DX265_DEPTH=10 -DX265_NS=x265_10bit -D__STDC_LIMIT_MACROS=1 -I/wrkdirs/usr/ports/multimedia/x265/work/x265_3.2.1/source/. -I/wrkdirs/usr/ports/multimedia/x265/work/x265_3.2.1/source/common -I/wrkdirs/usr/ports/multimedia/x265/work/x265_3.2.1/source/encoder -I. -O2 -pipe -DNDEBUG -O3 -fstack-protector-strong -fno-strict-aliasing -O2 -pipe -DNDEBUG -O3 -fstack-protector-strong -fno-strict-aliasing -Wall -Wextra -Wshadow -std=gnu++98 -fPIC -Wno-array-bounds -ffast-math -mstackrealign -fno-exceptions -Wno-uninitialized -MD -MT encoder/CMakeFiles/encoder.dir/framefilter.cpp.o -MF encoder/CMakeFiles/encoder.dir/framefilter.cpp.o.d -o encoder/CMakeFiles/encoder.dir/framefilter.cpp.o -c /wrkdirs/usr/ports/multimedia/x265/work/x265_3.2.1/source/encoder/framefilter.cpp
In file included from /wrkdirs/usr/ports/multimedia/x265/work/x265_3.2.1/source/encoder/framefilter.cpp:28:
In file included from /wrkdirs/usr/ports/multimedia/x265/work/x265_3.2.1/source/encoder/encoder.h:30:
/wrkdirs/usr/ports/multimedia/x265/work/x265_3.2.1/source/common/scalinglist.h:36:12: warning: declaration shadows a variable in namespace 'x265_10bit' [-Wshadow]
enum { NUM_SIZES = 4 }; // 4x4, 8x8, 16x16, 32x32
^
/wrkdirs/usr/ports/multimedia/x265/work/x265_3.2.1/source/common/cudata.h:51:5: note: previous declaration is here
NUM_SIZES
^
1 warning generated.
[32/51] /nxb-bin/usr/bin/c++ -DEXPORT_C_API=0 -DHAVE_INT_TYPES_H=1 -DHIGH_BIT_DEPTH=1 -DX265_DEPTH=10 -DX265_NS=x265_10bit -D__STDC_LIMIT_MACROS=1 -I/wrkdirs/usr/ports/multimedia/x265/work/x265_3.2.1/source/. -I/wrkdirs/usr/ports/multimedia/x265/work/x265_3.2.1/source/common -I/wrkdirs/usr/ports/multimedia/x265/work/x265_3.2.1/source/encoder -I. -O2 -pipe -DNDEBUG -O3 -fstack-protector-strong -fno-strict-aliasing -O2 -pipe -DNDEBUG -O3 -fstack-protector-strong -fno-strict-aliasing -Wall -Wextra -Wshadow -std=gnu++98 -fPIC -Wno-array-bounds -ffast-math -mstackrealign -fno-exceptions -Wno-uninitialized -MD -MT encoder/CMakeFiles/encoder.dir/motion.cpp.o -MF encoder/CMakeFiles/encoder.dir/motion.cpp.o.d -o encoder/CMakeFiles/encoder.dir/motion.cpp.o -c /wrkdirs/usr/ports/multimedia/x265/work/x265_3.2.1/source/encoder/motion.cpp
[33/51] /nxb-bin/usr/bin/c++ -DEXPORT_C_API=0 -DHAVE_INT_TYPES_H=1 -DHIGH_BIT_DEPTH=1 -DX265_DEPTH=10 -DX265_NS=x265_10bit -D__STDC_LIMIT_MACROS=1 -I/wrkdirs/usr/ports/multimedia/x265/work/x265_3.2.1/source/. -I/wrkdirs/usr/ports/multimedia/x265/work/x265_3.2.1/source/common -I/wrkdirs/usr/ports/multimedia/x265/work/x265_3.2.1/source/encoder -I. -O2 -pipe -DNDEBUG -O3 -fstack-protector-strong -fno-strict-aliasing -O2 -pipe -DNDEBUG -O3 -fstack-protector-strong -fno-strict-aliasing -Wall -Wextra -Wshadow -std=gnu++98 -fPIC -Wno-array-bounds -ffast-math -mstackrealign -fno-exceptions -Wno-uninitialized -MD -MT encoder/CMakeFiles/encoder.dir/nal.cpp.o -MF encoder/CMakeFiles/encoder.dir/nal.cpp.o.d -o encoder/CMakeFiles/encoder.dir/nal.cpp.o -c /wrkdirs/usr/ports/multimedia/x265/work/x265_3.2.1/source/encoder/nal.cpp
[34/51] /nxb-bin/usr/bin/c++ -DEXPORT_C_API=0 -DHAVE_INT_TYPES_H=1 -DHIGH_BIT_DEPTH=1 -DX265_DEPTH=10 -DX265_NS=x265_10bit -D__STDC_LIMIT_MACROS=1 -I/wrkdirs/usr/ports/multimedia/x265/work/x265_3.2.1/source/. -I/wrkdirs/usr/ports/multimedia/x265/work/x265_3.2.1/source/common -I/wrkdirs/usr/ports/multimedia/x265/work/x265_3.2.1/source/encoder -I. -O2 -pipe -DNDEBUG -O3 -fstack-protector-strong -fno-strict-aliasing -O2 -pipe -DNDEBUG -O3 -fstack-protector-strong -fno-strict-aliasing -Wall -Wextra -Wshadow -std=gnu++98 -fPIC -Wno-array-bounds -ffast-math -mstackrealign -fno-exceptions -Wno-uninitialized -Wno-strict-overflow -MD -MT encoder/CMakeFiles/encoder.dir/slicetype.cpp.o -MF encoder/CMakeFiles/encoder.dir/slicetype.cpp.o.d -o encoder/CMakeFiles/encoder.dir/slicetype.cpp.o -c /wrkdirs/usr/ports/multimedia/x265/work/x265_3.2.1/source/encoder/slicetype.cpp
[35/51] /nxb-bin/usr/bin/c++ -DEXPORT_C_API=0 -DHAVE_INT_TYPES_H=1 -DHIGH_BIT_DEPTH=1 -DX265_DEPTH=10 -DX265_NS=x265_10bit -D__STDC_LIMIT_MACROS=1 -I/wrkdirs/usr/ports/multimedia/x265/work/x265_3.2.1/source/. -I/wrkdirs/usr/ports/multimedia/x265/work/x265_3.2.1/source/common -I/wrkdirs/usr/ports/multimedia/x265/work/x265_3.2.1/source/encoder -I. -O2 -pipe -DNDEBUG -O3 -fstack-protector-strong -fno-strict-aliasing -O2 -pipe -DNDEBUG -O3 -fstack-protector-strong -fno-strict-aliasing -Wall -Wextra -Wshadow -std=gnu++98 -fPIC -Wno-array-bounds -ffast-math -mstackrealign -fno-exceptions -Wno-uninitialized -MD -MT encoder/CMakeFiles/encoder.dir/dpb.cpp.o -MF encoder/CMakeFiles/encoder.dir/dpb.cpp.o.d -o encoder/CMakeFiles/encoder.dir/dpb.cpp.o -c /wrkdirs/usr/ports/multimedia/x265/work/x265_3.2.1/source/encoder/dpb.cpp
[36/51] /nxb-bin/usr/bin/c++ -DEXPORT_C_API=0 -DHAVE_INT_TYPES_H=1 -DHIGH_BIT_DEPTH=1 -DX265_DEPTH=10 -DX265_NS=x265_10bit -D__STDC_LIMIT_MACROS=1 -I/wrkdirs/usr/ports/multimedia/x265/work/x265_3.2.1/source/. -I/wrkdirs/usr/ports/multimedia/x265/work/x265_3.2.1/source/common -I/wrkdirs/usr/ports/multimedia/x265/work/x265_3.2.1/source/encoder -I. -O2 -pipe -DNDEBUG -O3 -fstack-protector-strong -fno-strict-aliasing -O2 -pipe -DNDEBUG -O3 -fstack-protector-strong -fno-strict-aliasing -Wall -Wextra -Wshadow -std=gnu++98 -fPIC -Wno-array-bounds -ffast-math -mstackrealign -fno-exceptions -Wno-uninitialized -MD -MT encoder/CMakeFiles/encoder.dir/analysis.cpp.o -MF encoder/CMakeFiles/encoder.dir/analysis.cpp.o.d -o encoder/CMakeFiles/encoder.dir/analysis.cpp.o -c /wrkdirs/usr/ports/multimedia/x265/work/x265_3.2.1/source/encoder/analysis.cpp
In file included from /wrkdirs/usr/ports/multimedia/x265/work/x265_3.2.1/source/encoder/analysis.cpp:33:
In file included from /wrkdirs/usr/ports/multimedia/x265/work/x265_3.2.1/source/encoder/analysis.h:30:
In file included from /wrkdirs/usr/ports/multimedia/x265/work/x265_3.2.1/source/common/predict.h:30:
In file included from /wrkdirs/usr/ports/multimedia/x265/work/x265_3.2.1/source/common/quant.h:29:
/wrkdirs/usr/ports/multimedia/x265/work/x265_3.2.1/source/common/scalinglist.h:36:12: warning: declaration shadows a variable in namespace 'x265_10bit' [-Wshadow]
enum { NUM_SIZES = 4 }; // 4x4, 8x8, 16x16, 32x32
^
/wrkdirs/usr/ports/multimedia/x265/work/x265_3.2.1/source/common/cudata.h:51:5: note: previous declaration is here
NUM_SIZES
^
1 warning generated.
[37/51] /nxb-bin/usr/bin/c++ -DEXPORT_C_API=0 -DHAVE_INT_TYPES_H=1 -DHIGH_BIT_DEPTH=1 -DX265_DEPTH=10 -DX265_NS=x265_10bit -D__STDC_LIMIT_MACROS=1 -I/wrkdirs/usr/ports/multimedia/x265/work/x265_3.2.1/source/. -I/wrkdirs/usr/ports/multimedia/x265/work/x265_3.2.1/source/common -I/wrkdirs/usr/ports/multimedia/x265/work/x265_3.2.1/source/encoder -I. -O2 -pipe -DNDEBUG -O3 -fstack-protector-strong -fno-strict-aliasing -O2 -pipe -DNDEBUG -O3 -fstack-protector-strong -fno-strict-aliasing -Wall -Wextra -Wshadow -std=gnu++98 -fPIC -Wno-array-bounds -ffast-math -mstackrealign -fno-exceptions -Wno-uninitialized -MD -MT encoder/CMakeFiles/encoder.dir/search.cpp.o -MF encoder/CMakeFiles/encoder.dir/search.cpp.o.d -o encoder/CMakeFiles/encoder.dir/search.cpp.o -c /wrkdirs/usr/ports/multimedia/x265/work/x265_3.2.1/source/encoder/search.cpp
In file included from /wrkdirs/usr/ports/multimedia/x265/work/x265_3.2.1/source/encoder/search.cpp:30:
In file included from /wrkdirs/usr/ports/multimedia/x265/work/x265_3.2.1/source/encoder/search.h:29:
In file included from /wrkdirs/usr/ports/multimedia/x265/work/x265_3.2.1/source/common/predict.h:30:
In file included from /wrkdirs/usr/ports/multimedia/x265/work/x265_3.2.1/source/common/quant.h:29:
/wrkdirs/usr/ports/multimedia/x265/work/x265_3.2.1/source/common/scalinglist.h:36:12: warning: declaration shadows a variable in namespace 'x265_10bit' [-Wshadow]
enum { NUM_SIZES = 4 }; // 4x4, 8x8, 16x16, 32x32
^
/wrkdirs/usr/ports/multimedia/x265/work/x265_3.2.1/source/common/cudata.h:51:5: note: previous declaration is here
NUM_SIZES
^
1 warning generated.
[38/51] /nxb-bin/usr/bin/c++ -DEXPORT_C_API=0 -DHAVE_INT_TYPES_H=1 -DHIGH_BIT_DEPTH=1 -DX265_DEPTH=10 -DX265_NS=x265_10bit -D__STDC_LIMIT_MACROS=1 -I/wrkdirs/usr/ports/multimedia/x265/work/x265_3.2.1/source/. -I/wrkdirs/usr/ports/multimedia/x265/work/x265_3.2.1/source/common -I/wrkdirs/usr/ports/multimedia/x265/work/x265_3.2.1/source/encoder -I. -O2 -pipe -DNDEBUG -O3 -fstack-protector-strong -fno-strict-aliasing -O2 -pipe -DNDEBUG -O3 -fstack-protector-strong -fno-strict-aliasing -Wall -Wextra -Wshadow -std=gnu++98 -fPIC -Wno-array-bounds -ffast-math -mstackrealign -fno-exceptions -Wno-uninitialized -MD -MT encoder/CMakeFiles/encoder.dir/sei.cpp.o -MF encoder/CMakeFiles/encoder.dir/sei.cpp.o.d -o encoder/CMakeFiles/encoder.dir/sei.cpp.o -c /wrkdirs/usr/ports/multimedia/x265/work/x265_3.2.1/source/encoder/sei.cpp
[39/51] /nxb-bin/usr/bin/c++ -DEXPORT_C_API=0 -DHAVE_INT_TYPES_H=1 -DHIGH_BIT_DEPTH=1 -DX265_DEPTH=10 -DX265_NS=x265_10bit -D__STDC_LIMIT_MACROS=1 -I/wrkdirs/usr/ports/multimedia/x265/work/x265_3.2.1/source/. -I/wrkdirs/usr/ports/multimedia/x265/work/x265_3.2.1/source/common -I/wrkdirs/usr/ports/multimedia/x265/work/x265_3.2.1/source/encoder -I. -O2 -pipe -DNDEBUG -O3 -fstack-protector-strong -fno-strict-aliasing -O2 -pipe -DNDEBUG -O3 -fstack-protector-strong -fno-strict-aliasing -Wall -Wextra -Wshadow -std=gnu++98 -fPIC -Wno-array-bounds -ffast-math -mstackrealign -fno-exceptions -Wno-uninitialized -MD -MT encoder/CMakeFiles/encoder.dir/frameencoder.cpp.o -MF encoder/CMakeFiles/encoder.dir/frameencoder.cpp.o.d -o encoder/CMakeFiles/encoder.dir/frameencoder.cpp.o -c /wrkdirs/usr/ports/multimedia/x265/work/x265_3.2.1/source/encoder/frameencoder.cpp
In file included from /wrkdirs/usr/ports/multimedia/x265/work/x265_3.2.1/source/encoder/frameencoder.cpp:32:
In file included from /wrkdirs/usr/ports/multimedia/x265/work/x265_3.2.1/source/encoder/encoder.h:30:
/wrkdirs/usr/ports/multimedia/x265/work/x265_3.2.1/source/common/scalinglist.h:36:12: warning: declaration shadows a variable in namespace 'x265_10bit' [-Wshadow]
enum { NUM_SIZES = 4 }; // 4x4, 8x8, 16x16, 32x32
^
/wrkdirs/usr/ports/multimedia/x265/work/x265_3.2.1/source/common/cudata.h:51:5: note: previous declaration is here
NUM_SIZES
^
1 warning generated.
[40/51] /nxb-bin/usr/bin/c++ -DEXPORT_C_API=0 -DHAVE_INT_TYPES_H=1 -DHIGH_BIT_DEPTH=1 -DX265_DEPTH=10 -DX265_NS=x265_10bit -D__STDC_LIMIT_MACROS=1 -I/wrkdirs/usr/ports/multimedia/x265/work/x265_3.2.1/source/. -I/wrkdirs/usr/ports/multimedia/x265/work/x265_3.2.1/source/common -I/wrkdirs/usr/ports/multimedia/x265/work/x265_3.2.1/source/encoder -I. -O2 -pipe -DNDEBUG -O3 -fstack-protector-strong -fno-strict-aliasing -O2 -pipe -DNDEBUG -O3 -fstack-protector-strong -fno-strict-aliasing -Wall -Wextra -Wshadow -std=gnu++98 -fPIC -Wno-array-bounds -ffast-math -mstackrealign -fno-exceptions -Wno-uninitialized -MD -MT encoder/CMakeFiles/encoder.dir/reference.cpp.o -MF encoder/CMakeFiles/encoder.dir/reference.cpp.o.d -o encoder/CMakeFiles/encoder.dir/reference.cpp.o -c /wrkdirs/usr/ports/multimedia/x265/work/x265_3.2.1/source/encoder/reference.cpp
[41/51] /nxb-bin/usr/bin/c++ -DEXPORT_C_API=0 -DHAVE_INT_TYPES_H=1 -DHIGH_BIT_DEPTH=1 -DX265_DEPTH=10 -DX265_NS=x265_10bit -D__STDC_LIMIT_MACROS=1 -I/wrkdirs/usr/ports/multimedia/x265/work/x265_3.2.1/source/. -I/wrkdirs/usr/ports/multimedia/x265/work/x265_3.2.1/source/common -I/wrkdirs/usr/ports/multimedia/x265/work/x265_3.2.1/source/encoder -I. -O2 -pipe -DNDEBUG -O3 -fstack-protector-strong -fno-strict-aliasing -O2 -pipe -DNDEBUG -O3 -fstack-protector-strong -fno-strict-aliasing -Wall -Wextra -Wshadow -std=gnu++98 -fPIC -Wno-array-bounds -ffast-math -mstackrealign -fno-exceptions -Wno-uninitialized -MD -MT encoder/CMakeFiles/encoder.dir/entropy.cpp.o -MF encoder/CMakeFiles/encoder.dir/entropy.cpp.o.d -o encoder/CMakeFiles/encoder.dir/entropy.cpp.o -c /wrkdirs/usr/ports/multimedia/x265/work/x265_3.2.1/source/encoder/entropy.cpp
In file included from /wrkdirs/usr/ports/multimedia/x265/work/x265_3.2.1/source/encoder/entropy.cpp:27:
/wrkdirs/usr/ports/multimedia/x265/work/x265_3.2.1/source/common/scalinglist.h:36:12: warning: declaration shadows a variable in namespace 'x265_10bit' [-Wshadow]
enum { NUM_SIZES = 4 }; // 4x4, 8x8, 16x16, 32x32
^
/wrkdirs/usr/ports/multimedia/x265/work/x265_3.2.1/source/common/cudata.h:51:5: note: previous declaration is here
NUM_SIZES
^
1 warning generated.
[42/51] /nxb-bin/usr/bin/c++ -DEXPORT_C_API=0 -DHAVE_INT_TYPES_H=1 -DHIGH_BIT_DEPTH=1 -DX265_DEPTH=10 -DX265_NS=x265_10bit -D__STDC_LIMIT_MACROS=1 -I/wrkdirs/usr/ports/multimedia/x265/work/x265_3.2.1/source/. -I/wrkdirs/usr/ports/multimedia/x265/work/x265_3.2.1/source/common -I/wrkdirs/usr/ports/multimedia/x265/work/x265_3.2.1/source/encoder -I. -O2 -pipe -DNDEBUG -O3 -fstack-protector-strong -fno-strict-aliasing -O2 -pipe -DNDEBUG -O3 -fstack-protector-strong -fno-strict-aliasing -Wall -Wextra -Wshadow -std=gnu++98 -fPIC -Wno-array-bounds -ffast-math -mstackrealign -fno-exceptions -Wno-uninitialized -MD -MT encoder/CMakeFiles/encoder.dir/weightPrediction.cpp.o -MF encoder/CMakeFiles/encoder.dir/weightPrediction.cpp.o.d -o encoder/CMakeFiles/encoder.dir/weightPrediction.cpp.o -c /wrkdirs/usr/ports/multimedia/x265/work/x265_3.2.1/source/encoder/weightPrediction.cpp
[43/51] /nxb-bin/usr/bin/c++ -DEXPORT_C_API=0 -DHAVE_INT_TYPES_H=1 -DHIGH_BIT_DEPTH=1 -DX265_DEPTH=10 -DX265_NS=x265_10bit -D__STDC_LIMIT_MACROS=1 -I/wrkdirs/usr/ports/multimedia/x265/work/x265_3.2.1/source/. -I/wrkdirs/usr/ports/multimedia/x265/work/x265_3.2.1/source/common -I/wrkdirs/usr/ports/multimedia/x265/work/x265_3.2.1/source/encoder -I. -O2 -pipe -DNDEBUG -O3 -fstack-protector-strong -fno-strict-aliasing -O2 -pipe -DNDEBUG -O3 -fstack-protector-strong -fno-strict-aliasing -Wall -Wextra -Wshadow -std=gnu++98 -fPIC -Wno-array-bounds -ffast-math -mstackrealign -fno-exceptions -Wno-uninitialized -MD -MT encoder/CMakeFiles/encoder.dir/api.cpp.o -MF encoder/CMakeFiles/encoder.dir/api.cpp.o.d -o encoder/CMakeFiles/encoder.dir/api.cpp.o -c /wrkdirs/usr/ports/multimedia/x265/work/x265_3.2.1/source/encoder/api.cpp
[44/51] /nxb-bin/usr/bin/c++ -DEXPORT_C_API=0 -DHAVE_INT_TYPES_H=1 -DHIGH_BIT_DEPTH=1 -DX265_DEPTH=10 -DX265_NS=x265_10bit -D__STDC_LIMIT_MACROS=1 -I/wrkdirs/usr/ports/multimedia/x265/work/x265_3.2.1/source/. -I/wrkdirs/usr/ports/multimedia/x265/work/x265_3.2.1/source/common -I/wrkdirs/usr/ports/multimedia/x265/work/x265_3.2.1/source/encoder -I. -O2 -pipe -DNDEBUG -O3 -fstack-protector-strong -fno-strict-aliasing -O2 -pipe -DNDEBUG -O3 -fstack-protector-strong -fno-strict-aliasing -Wall -Wextra -Wshadow -std=gnu++98 -fPIC -Wno-array-bounds -ffast-math -mstackrealign -fno-exceptions -Wno-uninitialized -MD -MT encoder/CMakeFiles/encoder.dir/sao.cpp.o -MF encoder/CMakeFiles/encoder.dir/sao.cpp.o.d -o encoder/CMakeFiles/encoder.dir/sao.cpp.o -c /wrkdirs/usr/ports/multimedia/x265/work/x265_3.2.1/source/encoder/sao.cpp
[45/51] /nxb-bin/usr/bin/c++ -DEXPORT_C_API=0 -DHAVE_INT_TYPES_H=1 -DHIGH_BIT_DEPTH=1 -DX265_DEPTH=10 -DX265_NS=x265_10bit -D__STDC_LIMIT_MACROS=1 -I/wrkdirs/usr/ports/multimedia/x265/work/x265_3.2.1/source/. -I/wrkdirs/usr/ports/multimedia/x265/work/x265_3.2.1/source/common -I/wrkdirs/usr/ports/multimedia/x265/work/x265_3.2.1/source/encoder -I. -O2 -pipe -DNDEBUG -O3 -fstack-protector-strong -fno-strict-aliasing -O2 -pipe -DNDEBUG -O3 -fstack-protector-strong -fno-strict-aliasing -Wall -Wextra -Wshadow -std=gnu++98 -fPIC -Wno-array-bounds -ffast-math -mstackrealign -fno-exceptions -MD -MT common/CMakeFiles/common.dir/pixel.cpp.o -MF common/CMakeFiles/common.dir/pixel.cpp.o.d -o common/CMakeFiles/common.dir/pixel.cpp.o -c /wrkdirs/usr/ports/multimedia/x265/work/x265_3.2.1/source/common/pixel.cpp
[46/51] /nxb-bin/usr/bin/c++ -DEXPORT_C_API=0 -DHAVE_INT_TYPES_H=1 -DHIGH_BIT_DEPTH=1 -DX265_DEPTH=10 -DX265_NS=x265_10bit -D__STDC_LIMIT_MACROS=1 -I/wrkdirs/usr/ports/multimedia/x265/work/x265_3.2.1/source/. -I/wrkdirs/usr/ports/multimedia/x265/work/x265_3.2.1/source/common -I/wrkdirs/usr/ports/multimedia/x265/work/x265_3.2.1/source/encoder -I. -O2 -pipe -DNDEBUG -O3 -fstack-protector-strong -fno-strict-aliasing -O2 -pipe -DNDEBUG -O3 -fstack-protector-strong -fno-strict-aliasing -Wall -Wextra -Wshadow -std=gnu++98 -fPIC -Wno-array-bounds -ffast-math -mstackrealign -fno-exceptions -Wno-uninitialized -MD -MT encoder/CMakeFiles/encoder.dir/encoder.cpp.o -MF encoder/CMakeFiles/encoder.dir/encoder.cpp.o.d -o encoder/CMakeFiles/encoder.dir/encoder.cpp.o -c /wrkdirs/usr/ports/multimedia/x265/work/x265_3.2.1/source/encoder/encoder.cpp
In file included from /wrkdirs/usr/ports/multimedia/x265/work/x265_3.2.1/source/encoder/encoder.cpp:36:
In file included from /wrkdirs/usr/ports/multimedia/x265/work/x265_3.2.1/source/encoder/encoder.h:30:
/wrkdirs/usr/ports/multimedia/x265/work/x265_3.2.1/source/common/scalinglist.h:36:12: warning: declaration shadows a variable in namespace 'x265_10bit' [-Wshadow]
enum { NUM_SIZES = 4 }; // 4x4, 8x8, 16x16, 32x32
^
/wrkdirs/usr/ports/multimedia/x265/work/x265_3.2.1/source/common/cudata.h:51:5: note: previous declaration is here
NUM_SIZES
^
1 warning generated.
[47/51] /nxb-bin/usr/bin/c++ -DEXPORT_C_API=0 -DHAVE_INT_TYPES_H=1 -DHIGH_BIT_DEPTH=1 -DX265_DEPTH=10 -DX265_NS=x265_10bit -D__STDC_LIMIT_MACROS=1 -I/wrkdirs/usr/ports/multimedia/x265/work/x265_3.2.1/source/. -I/wrkdirs/usr/ports/multimedia/x265/work/x265_3.2.1/source/common -I/wrkdirs/usr/ports/multimedia/x265/work/x265_3.2.1/source/encoder -I. -O2 -pipe -DNDEBUG -O3 -fstack-protector-strong -fno-strict-aliasing -O2 -pipe -DNDEBUG -O3 -fstack-protector-strong -fno-strict-aliasing -Wall -Wextra -Wshadow -std=gnu++98 -fPIC -Wno-array-bounds -ffast-math -mstackrealign -fno-exceptions -Wno-uninitialized -MD -MT encoder/CMakeFiles/encoder.dir/ratecontrol.cpp.o -MF encoder/CMakeFiles/encoder.dir/ratecontrol.cpp.o.d -o encoder/CMakeFiles/encoder.dir/ratecontrol.cpp.o -c /wrkdirs/usr/ports/multimedia/x265/work/x265_3.2.1/source/encoder/ratecontrol.cpp
In file included from /wrkdirs/usr/ports/multimedia/x265/work/x265_3.2.1/source/encoder/ratecontrol.cpp:36:
In file included from /wrkdirs/usr/ports/multimedia/x265/work/x265_3.2.1/source/encoder/encoder.h:30:
/wrkdirs/usr/ports/multimedia/x265/work/x265_3.2.1/source/common/scalinglist.h:36:12: warning: declaration shadows a variable in namespace 'x265_10bit' [-Wshadow]
enum { NUM_SIZES = 4 }; // 4x4, 8x8, 16x16, 32x32
^
/wrkdirs/usr/ports/multimedia/x265/work/x265_3.2.1/source/common/cudata.h:51:5: note: previous declaration is here
NUM_SIZES
^
1 warning generated.
[48/51] /nxb-bin/usr/bin/c++ -DEXPORT_C_API=0 -DHAVE_INT_TYPES_H=1 -DHIGH_BIT_DEPTH=1 -DX265_DEPTH=10 -DX265_NS=x265_10bit -D__STDC_LIMIT_MACROS=1 -I/wrkdirs/usr/ports/multimedia/x265/work/x265_3.2.1/source/. -I/wrkdirs/usr/ports/multimedia/x265/work/x265_3.2.1/source/common -I/wrkdirs/usr/ports/multimedia/x265/work/x265_3.2.1/source/encoder -I. -O2 -pipe -DNDEBUG -O3 -fstack-protector-strong -fno-strict-aliasing -O2 -pipe -DNDEBUG -O3 -fstack-protector-strong -fno-strict-aliasing -Wall -Wextra -Wshadow -std=gnu++98 -fPIC -Wno-array-bounds -ffast-math -mstackrealign -fno-exceptions -MD -MT common/CMakeFiles/common.dir/ipfilter.cpp.o -MF common/CMakeFiles/common.dir/ipfilter.cpp.o.d -o common/CMakeFiles/common.dir/ipfilter.cpp.o -c /wrkdirs/usr/ports/multimedia/x265/work/x265_3.2.1/source/common/ipfilter.cpp
[49/51] : && /nxb-bin/usr/bin/c++ -fPIC -O2 -pipe -DNDEBUG -O3 -fstack-protector-strong -fno-strict-aliasing -O2 -pipe -DNDEBUG -O3 -fstack-protector-strong -fno-strict-aliasing -fstack-protector-strong -Wl,-Bsymbolic,-znoexecstack -shared -Wl,-soname,libx265.so.179 -o libx265.so.179 encoder/CMakeFiles/encoder.dir/analysis.cpp.o encoder/CMakeFiles/encoder.dir/search.cpp.o encoder/CMakeFiles/encoder.dir/bitcost.cpp.o encoder/CMakeFiles/encoder.dir/motion.cpp.o encoder/CMakeFiles/encoder.dir/slicetype.cpp.o encoder/CMakeFiles/encoder.dir/frameencoder.cpp.o encoder/CMakeFiles/encoder.dir/framefilter.cpp.o encoder/CMakeFiles/encoder.dir/level.cpp.o encoder/CMakeFiles/encoder.dir/nal.cpp.o encoder/CMakeFiles/encoder.dir/sei.cpp.o encoder/CMakeFiles/encoder.dir/sao.cpp.o encoder/CMakeFiles/encoder.dir/entropy.cpp.o encoder/CMakeFiles/encoder.dir/dpb.cpp.o encoder/CMakeFiles/encoder.dir/ratecontrol.cpp.o encoder/CMakeFiles/encoder.dir/reference.cpp.o encoder/CMakeFiles/encoder.dir/encoder.cpp.o encoder/CMakeFiles/encoder.dir/api.cpp.o encoder/CMakeFiles/encoder.dir/weightPrediction.cpp.o common/CMakeFiles/common.dir/primitives.cpp.o common/CMakeFiles/common.dir/pixel.cpp.o common/CMakeFiles/common.dir/dct.cpp.o common/CMakeFiles/common.dir/lowpassdct.cpp.o common/CMakeFiles/common.dir/ipfilter.cpp.o common/CMakeFiles/common.dir/intrapred.cpp.o common/CMakeFiles/common.dir/loopfilter.cpp.o common/CMakeFiles/common.dir/constants.cpp.o common/CMakeFiles/common.dir/cpu.cpp.o common/CMakeFiles/common.dir/version.cpp.o common/CMakeFiles/common.dir/threading.cpp.o common/CMakeFiles/common.dir/threadpool.cpp.o common/CMakeFiles/common.dir/wavefront.cpp.o common/CMakeFiles/common.dir/md5.cpp.o common/CMakeFiles/common.dir/bitstream.cpp.o common/CMakeFiles/common.dir/yuv.cpp.o common/CMakeFiles/common.dir/shortyuv.cpp.o common/CMakeFiles/common.dir/picyuv.cpp.o common/CMakeFiles/common.dir/common.cpp.o common/CMakeFiles/common.dir/param.cpp.o common/CMakeFiles/common.dir/frame.cpp.o common/CMakeFiles/common.dir/framedata.cpp.o common/CMakeFiles/common.dir/cudata.cpp.o common/CMakeFiles/common.dir/slice.cpp.o common/CMakeFiles/common.dir/lowres.cpp.o common/CMakeFiles/common.dir/piclist.cpp.o common/CMakeFiles/common.dir/predict.cpp.o common/CMakeFiles/common.dir/scalinglist.cpp.o common/CMakeFiles/common.dir/quant.cpp.o common/CMakeFiles/common.dir/deblock.cpp.o -lpthread -lrt -ldl && :
[50/51] : && /usr/local/bin/cmake -E remove libx265.a && /nxb-bin/usr/bin/ar qc libx265.a encoder/CMakeFiles/encoder.dir/analysis.cpp.o encoder/CMakeFiles/encoder.dir/search.cpp.o encoder/CMakeFiles/encoder.dir/bitcost.cpp.o encoder/CMakeFiles/encoder.dir/motion.cpp.o encoder/CMakeFiles/encoder.dir/slicetype.cpp.o encoder/CMakeFiles/encoder.dir/frameencoder.cpp.o encoder/CMakeFiles/encoder.dir/framefilter.cpp.o encoder/CMakeFiles/encoder.dir/level.cpp.o encoder/CMakeFiles/encoder.dir/nal.cpp.o encoder/CMakeFiles/encoder.dir/sei.cpp.o encoder/CMakeFiles/encoder.dir/sao.cpp.o encoder/CMakeFiles/encoder.dir/entropy.cpp.o encoder/CMakeFiles/encoder.dir/dpb.cpp.o encoder/CMakeFiles/encoder.dir/ratecontrol.cpp.o encoder/CMakeFiles/encoder.dir/reference.cpp.o encoder/CMakeFiles/encoder.dir/encoder.cpp.o encoder/CMakeFiles/encoder.dir/api.cpp.o encoder/CMakeFiles/encoder.dir/weightPrediction.cpp.o common/CMakeFiles/common.dir/primitives.cpp.o common/CMakeFiles/common.dir/pixel.cpp.o common/CMakeFiles/common.dir/dct.cpp.o common/CMakeFiles/common.dir/lowpassdct.cpp.o common/CMakeFiles/common.dir/ipfilter.cpp.o common/CMakeFiles/common.dir/intrapred.cpp.o common/CMakeFiles/common.dir/loopfilter.cpp.o common/CMakeFiles/common.dir/constants.cpp.o common/CMakeFiles/common.dir/cpu.cpp.o common/CMakeFiles/common.dir/version.cpp.o common/CMakeFiles/common.dir/threading.cpp.o common/CMakeFiles/common.dir/threadpool.cpp.o common/CMakeFiles/common.dir/wavefront.cpp.o common/CMakeFiles/common.dir/md5.cpp.o common/CMakeFiles/common.dir/bitstream.cpp.o common/CMakeFiles/common.dir/yuv.cpp.o common/CMakeFiles/common.dir/shortyuv.cpp.o common/CMakeFiles/common.dir/picyuv.cpp.o common/CMakeFiles/common.dir/common.cpp.o common/CMakeFiles/common.dir/param.cpp.o common/CMakeFiles/common.dir/frame.cpp.o common/CMakeFiles/common.dir/framedata.cpp.o common/CMakeFiles/common.dir/cudata.cpp.o common/CMakeFiles/common.dir/slice.cpp.o common/CMakeFiles/common.dir/lowres.cpp.o common/CMakeFiles/common.dir/piclist.cpp.o common/CMakeFiles/common.dir/predict.cpp.o common/CMakeFiles/common.dir/scalinglist.cpp.o common/CMakeFiles/common.dir/quant.cpp.o common/CMakeFiles/common.dir/deblock.cpp.o && /nxb-bin/usr/bin/ranlib libx265.a && :
[51/51] /usr/local/bin/cmake -E cmake_symlink_library libx265.so.179 libx265.so.179 libx265.so && :
/bin/ln /wrkdirs/usr/ports/multimedia/x265/work/x265_3.2.1/10bit/libx265.a /wrkdirs/usr/ports/multimedia/x265/work/x265_3.2.1/10bit/libx265_10bit.a
echo "---> Built the 10-bit library ---"
---> Built the 10-bit library ---
---> Building the 12-bit library ---
/bin/mkdir -p /wrkdirs/usr/ports/multimedia/x265/work/x265_3.2.1/12bit
/usr/local/bin/cmake -S /wrkdirs/usr/ports/multimedia/x265/work/x265_3.2.1/source -B /wrkdirs/usr/ports/multimedia/x265/work/x265_3.2.1/12bit -DENABLE_PIC:BOOL=true -DCMAKE_C_COMPILER:STRING="/nxb-bin/usr/bin/cc" -DCMAKE_CXX_COMPILER:STRING="/nxb-bin/usr/bin/c++" -DCMAKE_C_FLAGS:STRING="-O2 -pipe -DNDEBUG -O3 -fstack-protector-strong -fno-strict-aliasing " -DCMAKE_C_FLAGS_DEBUG:STRING="-O2 -pipe -DNDEBUG -O3 -fstack-protector-strong -fno-strict-aliasing " -DCMAKE_C_FLAGS_RELEASE:STRING="-O2 -pipe -DNDEBUG -O3 -fstack-protector-strong -fno-strict-aliasing " -DCMAKE_CXX_FLAGS:STRING="-O2 -pipe -DNDEBUG -O3 -fstack-protector-strong -fno-strict-aliasing " -DCMAKE_CXX_FLAGS_DEBUG:STRING="-O2 -pipe -DNDEBUG -O3 -fstack-protector-strong -fno-strict-aliasing " -DCMAKE_CXX_FLAGS_RELEASE:STRING="-O2 -pipe -DNDEBUG -O3 -fstack-protector-strong -fno-strict-aliasing " -DCMAKE_EXE_LINKER_FLAGS:STRING=" -fstack-protector-strong " -DCMAKE_MODULE_LINKER_FLAGS:STRING=" -fstack-protector-strong " -DCMAKE_SHARED_LINKER_FLAGS:STRING=" -fstack-protector-strong " -DCMAKE_INSTALL_PREFIX:PATH="/usr/local" -DCMAKE_BUILD_TYPE:STRING="Release" -DTHREADS_HAVE_PTHREAD_ARG:BOOL=YES -DCMAKE_INSTALL_RPATH_USE_LINK_PATH=YES -DCMAKE_VERBOSE_MAKEFILE:BOOL=ON -DCMAKE_COLOR_MAKEFILE:BOOL=OFF -GNinja -DHIGH_BIT_DEPTH:BOOL=true -DMAIN12:BOOL=true -DENABLE_ASSEMBLY:BOOL=true -DEXPORT_C_API:BOOL=false -DENABLE_CLI=false
-- cmake version 3.16.3
CMake Deprecation Warning at CMakeLists.txt:10 (cmake_policy):
The OLD behavior for policy CMP0025 will be removed from a future version
of CMake.
The cmake-policies(7) manual explains that the OLD behaviors of all
policies are deprecated and that a policy should be set to OLD only under
specific short-term circumstances. Projects should be ported to the NEW
behavior and not rely on setting a policy to OLD.
CMake Deprecation Warning at CMakeLists.txt:16 (cmake_policy):
The OLD behavior for policy CMP0054 will be removed from a future version
of CMake.
The cmake-policies(7) manual explains that the OLD behaviors of all
policies are deprecated and that a policy should be set to OLD only under
specific short-term circumstances. Projects should be ported to the NEW
behavior and not rely on setting a policy to OLD.
-- The C compiler identification is Clang 8.0.1
-- The CXX compiler identification is Clang 8.0.1
-- Check for working C compiler: /nxb-bin/usr/bin/cc
-- Check for working C compiler: /nxb-bin/usr/bin/cc -- works
-- Detecting C compiler ABI info
-- Detecting C compiler ABI info - done
-- Detecting C compile features
-- Detecting C compile features - done
-- Check for working CXX compiler: /nxb-bin/usr/bin/c++
-- Check for working CXX compiler: /nxb-bin/usr/bin/c++ -- works
-- Detecting CXX compiler ABI info
-- Detecting CXX compiler ABI info - done
-- Detecting CXX compile features
-- Detecting CXX compile features - done
-- CMAKE_SYSTEM_PROCESSOR value `armv6` is unknown
-- Please add this value near /wrkdirs/usr/ports/multimedia/x265/work/x265_3.2.1/source/CMakeLists.txt:78
-- Could NOT find NUMA (missing: NUMA_ROOT_DIR NUMA_INCLUDE_DIR NUMA_LIBRARY)
-- Looking for include file inttypes.h
-- Looking for include file inttypes.h - found
-- Performing Test CC_HAS_NO_STRICT_OVERFLOW
-- Performing Test CC_HAS_NO_STRICT_OVERFLOW - Success
-- Performing Test CC_HAS_NO_NARROWING
-- Performing Test CC_HAS_NO_NARROWING - Success
-- Performing Test CC_HAS_NO_ARRAY_BOUNDS
-- Performing Test CC_HAS_NO_ARRAY_BOUNDS - Success
-- Performing Test CC_HAS_FAST_MATH
-- Performing Test CC_HAS_FAST_MATH - Success
-- Performing Test CC_HAS_STACK_REALIGN
-- Performing Test CC_HAS_STACK_REALIGN - Success
-- Performing Test CC_HAS_FNO_EXCEPTIONS_FLAG
-- Performing Test CC_HAS_FNO_EXCEPTIONS_FLAG - Success
-- Found nasm: /usr/local/bin/nasm (found version "2.14.02")
-- x265 version 3.2.1+1-b5c86a64bbbe
-- Looking for strtok_r
-- Looking for strtok_r - found
-- Configuring done
-- Generating done
CMake Warning:
Manually-specified variables were not used by the project:
CMAKE_COLOR_MAKEFILE
CMAKE_CXX_FLAGS_DEBUG
CMAKE_C_FLAGS_DEBUG
CMAKE_C_FLAGS_RELEASE
CMAKE_EXE_LINKER_FLAGS
CMAKE_MODULE_LINKER_FLAGS
CMAKE_VERBOSE_MAKEFILE
THREADS_HAVE_PTHREAD_ARG
-- Build files have been written to: /wrkdirs/usr/ports/multimedia/x265/work/x265_3.2.1/12bit
/usr/bin/env XDG_DATA_HOME=/wrkdirs/usr/ports/multimedia/x265/work XDG_CONFIG_HOME=/wrkdirs/usr/ports/multimedia/x265/work HOME=/wrkdirs/usr/ports/multimedia/x265/work TMPDIR="/tmp" PATH=/wrkdirs/usr/ports/multimedia/x265/work/.bin:/sbin:/bin:/usr/sbin:/usr/bin:/usr/local/sbin:/usr/local/bin:/nonexistent/bin NO_PIE=yes MK_DEBUG_FILES=no MK_KERNEL_SYMBOLS=no SHELL=/bin/sh NO_LINT=YES DESTDIR=/wrkdirs/usr/ports/multimedia/x265/work/stage PREFIX=/usr/local LOCALBASE=/usr/local CC="/nxb-bin/usr/bin/cc" CFLAGS="-O2 -pipe -DNDEBUG -O3 -fstack-protector-strong -fno-strict-aliasing " CPP="/nxb-bin/usr/bin/cpp" CPPFLAGS="" LDFLAGS=" -fstack-protector-strong " LIBS="" CXX="/nxb-bin/usr/bin/c++" CXXFLAGS="-O2 -pipe -DNDEBUG -O3 -fstack-protector-strong -fno-strict-aliasing " MANPREFIX="/usr/local" BSD_INSTALL_PROGRAM="install -s -m 555" BSD_INSTALL_LIB="install -s -m 0644" BSD_INSTALL_SCRIPT="install -m 555" BSD_INSTALL_DATA="install -m 0644" BSD_INSTALL_MAN="install -m 444" ninja -C /wrkdirs/usr/ports/multimedia/x265/work/x265_3.2.1/12bit -v
ninja: Entering directory `/wrkdirs/usr/ports/multimedia/x265/work/x265_3.2.1/12bit'
[1/51] /nxb-bin/usr/bin/c++ -DEXPORT_C_API=0 -DHAVE_INT_TYPES_H=1 -DHIGH_BIT_DEPTH=1 -DX265_DEPTH=12 -DX265_NS=x265_12bit -D__STDC_LIMIT_MACROS=1 -I/wrkdirs/usr/ports/multimedia/x265/work/x265_3.2.1/source/. -I/wrkdirs/usr/ports/multimedia/x265/work/x265_3.2.1/source/common -I/wrkdirs/usr/ports/multimedia/x265/work/x265_3.2.1/source/encoder -I. -O2 -pipe -DNDEBUG -O3 -fstack-protector-strong -fno-strict-aliasing -O2 -pipe -DNDEBUG -O3 -fstack-protector-strong -fno-strict-aliasing -Wall -Wextra -Wshadow -std=gnu++98 -fPIC -Wno-array-bounds -ffast-math -mstackrealign -fno-exceptions -Wno-narrowing -MD -MT common/CMakeFiles/common.dir/cpu.cpp.o -MF common/CMakeFiles/common.dir/cpu.cpp.o.d -o common/CMakeFiles/common.dir/cpu.cpp.o -c /wrkdirs/usr/ports/multimedia/x265/work/x265_3.2.1/source/common/cpu.cpp
/wrkdirs/usr/ports/multimedia/x265/work/x265_3.2.1/source/common/cpu.cpp:387:26: warning: unused parameter 'benableavx512' [-Wunused-parameter]
uint32_t cpu_detect(bool benableavx512)
^
/wrkdirs/usr/ports/multimedia/x265/work/x265_3.2.1/source/common/cpu.cpp:61:13: warning: unused variable 'enable512' [-Wunused-variable]
static bool enable512 = false;
^
2 warnings generated.
[2/51] /nxb-bin/usr/bin/c++ -DEXPORT_C_API=0 -DHAVE_INT_TYPES_H=1 -DHIGH_BIT_DEPTH=1 -DX265_DEPTH=12 -DX265_NS=x265_12bit -D__STDC_LIMIT_MACROS=1 -I/wrkdirs/usr/ports/multimedia/x265/work/x265_3.2.1/source/. -I/wrkdirs/usr/ports/multimedia/x265/work/x265_3.2.1/source/common -I/wrkdirs/usr/ports/multimedia/x265/work/x265_3.2.1/source/encoder -I. -O2 -pipe -DNDEBUG -O3 -fstack-protector-strong -fno-strict-aliasing -O2 -pipe -DNDEBUG -O3 -fstack-protector-strong -fno-strict-aliasing -Wall -Wextra -Wshadow -std=gnu++98 -fPIC -Wno-array-bounds -ffast-math -mstackrealign -fno-exceptions -MD -MT common/CMakeFiles/common.dir/loopfilter.cpp.o -MF common/CMakeFiles/common.dir/loopfilter.cpp.o.d -o common/CMakeFiles/common.dir/loopfilter.cpp.o -c /wrkdirs/usr/ports/multimedia/x265/work/x265_3.2.1/source/common/loopfilter.cpp
[3/51] /nxb-bin/usr/bin/c++ -DEXPORT_C_API=0 -DHAVE_INT_TYPES_H=1 -DHIGH_BIT_DEPTH=1 -DX265_DEPTH=12 -DX265_NS=x265_12bit -D__STDC_LIMIT_MACROS=1 -I/wrkdirs/usr/ports/multimedia/x265/work/x265_3.2.1/source/. -I/wrkdirs/usr/ports/multimedia/x265/work/x265_3.2.1/source/common -I/wrkdirs/usr/ports/multimedia/x265/work/x265_3.2.1/source/encoder -I. -O2 -pipe -DNDEBUG -O3 -fstack-protector-strong -fno-strict-aliasing -O2 -pipe -DNDEBUG -O3 -fstack-protector-strong -fno-strict-aliasing -Wall -Wextra -Wshadow -std=gnu++98 -fPIC -Wno-array-bounds -ffast-math -mstackrealign -fno-exceptions -DENABLE_ASSEMBLY=1 -MD -MT common/CMakeFiles/common.dir/primitives.cpp.o -MF common/CMakeFiles/common.dir/primitives.cpp.o.d -o common/CMakeFiles/common.dir/primitives.cpp.o -c /wrkdirs/usr/ports/multimedia/x265/work/x265_3.2.1/source/common/primitives.cpp
[4/51] /nxb-bin/usr/bin/c++ -DEXPORT_C_API=0 -DHAVE_INT_TYPES_H=1 -DHIGH_BIT_DEPTH=1 -DX265_DEPTH=12 -DX265_NS=x265_12bit -D__STDC_LIMIT_MACROS=1 -I/wrkdirs/usr/ports/multimedia/x265/work/x265_3.2.1/source/. -I/wrkdirs/usr/ports/multimedia/x265/work/x265_3.2.1/source/common -I/wrkdirs/usr/ports/multimedia/x265/work/x265_3.2.1/source/encoder -I. -O2 -pipe -DNDEBUG -O3 -fstack-protector-strong -fno-strict-aliasing -O2 -pipe -DNDEBUG -O3 -fstack-protector-strong -fno-strict-aliasing -Wall -Wextra -Wshadow -std=gnu++98 -fPIC -Wno-array-bounds -ffast-math -mstackrealign -fno-exceptions -MD -MT common/CMakeFiles/common.dir/constants.cpp.o -MF common/CMakeFiles/common.dir/constants.cpp.o.d -o common/CMakeFiles/common.dir/constants.cpp.o -c /wrkdirs/usr/ports/multimedia/x265/work/x265_3.2.1/source/common/constants.cpp
[5/51] /nxb-bin/usr/bin/c++ -DEXPORT_C_API=0 -DHAVE_INT_TYPES_H=1 -DHIGH_BIT_DEPTH=1 -DX265_DEPTH=12 -DX265_NS=x265_12bit -D__STDC_LIMIT_MACROS=1 -I/wrkdirs/usr/ports/multimedia/x265/work/x265_3.2.1/source/. -I/wrkdirs/usr/ports/multimedia/x265/work/x265_3.2.1/source/common -I/wrkdirs/usr/ports/multimedia/x265/work/x265_3.2.1/source/encoder -I. -O2 -pipe -DNDEBUG -O3 -fstack-protector-strong -fno-strict-aliasing -O2 -pipe -DNDEBUG -O3 -fstack-protector-strong -fno-strict-aliasing -Wall -Wextra -Wshadow -std=gnu++98 -fPIC -Wno-array-bounds -ffast-math -mstackrealign -fno-exceptions -MD -MT common/CMakeFiles/common.dir/yuv.cpp.o -MF common/CMakeFiles/common.dir/yuv.cpp.o.d -o common/CMakeFiles/common.dir/yuv.cpp.o -c /wrkdirs/usr/ports/multimedia/x265/work/x265_3.2.1/source/common/yuv.cpp
[6/51] /nxb-bin/usr/bin/c++ -DEXPORT_C_API=0 -DHAVE_INT_TYPES_H=1 -DHIGH_BIT_DEPTH=1 -DX265_DEPTH=12 -DX265_NS=x265_12bit -D__STDC_LIMIT_MACROS=1 -I/wrkdirs/usr/ports/multimedia/x265/work/x265_3.2.1/source/. -I/wrkdirs/usr/ports/multimedia/x265/work/x265_3.2.1/source/common -I/wrkdirs/usr/ports/multimedia/x265/work/x265_3.2.1/source/encoder -I. -O2 -pipe -DNDEBUG -O3 -fstack-protector-strong -fno-strict-aliasing -O2 -pipe -DNDEBUG -O3 -fstack-protector-strong -fno-strict-aliasing -Wall -Wextra -Wshadow -std=gnu++98 -fPIC -Wno-array-bounds -ffast-math -mstackrealign -fno-exceptions -MD -MT common/CMakeFiles/common.dir/lowpassdct.cpp.o -MF common/CMakeFiles/common.dir/lowpassdct.cpp.o.d -o common/CMakeFiles/common.dir/lowpassdct.cpp.o -c /wrkdirs/usr/ports/multimedia/x265/work/x265_3.2.1/source/common/lowpassdct.cpp
[7/51] /nxb-bin/usr/bin/c++ -DEXPORT_C_API=0 -DHAVE_INT_TYPES_H=1 -DHIGH_BIT_DEPTH=1 -DX265_DEPTH=12 -DX265_NS=x265_12bit -D__STDC_LIMIT_MACROS=1 -I/wrkdirs/usr/ports/multimedia/x265/work/x265_3.2.1/source/. -I/wrkdirs/usr/ports/multimedia/x265/work/x265_3.2.1/source/common -I/wrkdirs/usr/ports/multimedia/x265/work/x265_3.2.1/source/encoder -I. -O2 -pipe -DNDEBUG -O3 -fstack-protector-strong -fno-strict-aliasing -O2 -pipe -DNDEBUG -O3 -fstack-protector-strong -fno-strict-aliasing -Wall -Wextra -Wshadow -std=gnu++98 -fPIC -Wno-array-bounds -ffast-math -mstackrealign -fno-exceptions -DX265_VERSION=3.2.1+1-b5c86a64bbbe -DENABLE_ASSEMBLY=1 -MD -MT common/CMakeFiles/common.dir/version.cpp.o -MF common/CMakeFiles/common.dir/version.cpp.o.d -o common/CMakeFiles/common.dir/version.cpp.o -c /wrkdirs/usr/ports/multimedia/x265/work/x265_3.2.1/source/common/version.cpp
[8/51] /nxb-bin/usr/bin/c++ -DEXPORT_C_API=0 -DHAVE_INT_TYPES_H=1 -DHIGH_BIT_DEPTH=1 -DX265_DEPTH=12 -DX265_NS=x265_12bit -D__STDC_LIMIT_MACROS=1 -I/wrkdirs/usr/ports/multimedia/x265/work/x265_3.2.1/source/. -I/wrkdirs/usr/ports/multimedia/x265/work/x265_3.2.1/source/common -I/wrkdirs/usr/ports/multimedia/x265/work/x265_3.2.1/source/encoder -I. -O2 -pipe -DNDEBUG -O3 -fstack-protector-strong -fno-strict-aliasing -O2 -pipe -DNDEBUG -O3 -fstack-protector-strong -fno-strict-aliasing -Wall -Wextra -Wshadow -std=gnu++98 -fPIC -Wno-array-bounds -ffast-math -mstackrealign -fno-exceptions -MD -MT common/CMakeFiles/common.dir/wavefront.cpp.o -MF common/CMakeFiles/common.dir/wavefront.cpp.o.d -o common/CMakeFiles/common.dir/wavefront.cpp.o -c /wrkdirs/usr/ports/multimedia/x265/work/x265_3.2.1/source/common/wavefront.cpp
[9/51] /nxb-bin/usr/bin/c++ -DEXPORT_C_API=0 -DHAVE_INT_TYPES_H=1 -DHIGH_BIT_DEPTH=1 -DX265_DEPTH=12 -DX265_NS=x265_12bit -D__STDC_LIMIT_MACROS=1 -I/wrkdirs/usr/ports/multimedia/x265/work/x265_3.2.1/source/. -I/wrkdirs/usr/ports/multimedia/x265/work/x265_3.2.1/source/common -I/wrkdirs/usr/ports/multimedia/x265/work/x265_3.2.1/source/encoder -I. -O2 -pipe -DNDEBUG -O3 -fstack-protector-strong -fno-strict-aliasing -O2 -pipe -DNDEBUG -O3 -fstack-protector-strong -fno-strict-aliasing -Wall -Wextra -Wshadow -std=gnu++98 -fPIC -Wno-array-bounds -ffast-math -mstackrealign -fno-exceptions -DENABLE_ASSEMBLY=1 -MD -MT common/CMakeFiles/common.dir/threading.cpp.o -MF common/CMakeFiles/common.dir/threading.cpp.o.d -o common/CMakeFiles/common.dir/threading.cpp.o -c /wrkdirs/usr/ports/multimedia/x265/work/x265_3.2.1/source/common/threading.cpp
[10/51] /nxb-bin/usr/bin/c++ -DEXPORT_C_API=0 -DHAVE_INT_TYPES_H=1 -DHIGH_BIT_DEPTH=1 -DX265_DEPTH=12 -DX265_NS=x265_12bit -D__STDC_LIMIT_MACROS=1 -I/wrkdirs/usr/ports/multimedia/x265/work/x265_3.2.1/source/. -I/wrkdirs/usr/ports/multimedia/x265/work/x265_3.2.1/source/common -I/wrkdirs/usr/ports/multimedia/x265/work/x265_3.2.1/source/encoder -I. -O2 -pipe -DNDEBUG -O3 -fstack-protector-strong -fno-strict-aliasing -O2 -pipe -DNDEBUG -O3 -fstack-protector-strong -fno-strict-aliasing -Wall -Wextra -Wshadow -std=gnu++98 -fPIC -Wno-array-bounds -ffast-math -mstackrealign -fno-exceptions -MD -MT common/CMakeFiles/common.dir/bitstream.cpp.o -MF common/CMakeFiles/common.dir/bitstream.cpp.o.d -o common/CMakeFiles/common.dir/bitstream.cpp.o -c /wrkdirs/usr/ports/multimedia/x265/work/x265_3.2.1/source/common/bitstream.cpp
[11/51] /nxb-bin/usr/bin/c++ -DEXPORT_C_API=0 -DHAVE_INT_TYPES_H=1 -DHIGH_BIT_DEPTH=1 -DX265_DEPTH=12 -DX265_NS=x265_12bit -D__STDC_LIMIT_MACROS=1 -I/wrkdirs/usr/ports/multimedia/x265/work/x265_3.2.1/source/. -I/wrkdirs/usr/ports/multimedia/x265/work/x265_3.2.1/source/common -I/wrkdirs/usr/ports/multimedia/x265/work/x265_3.2.1/source/encoder -I. -O2 -pipe -DNDEBUG -O3 -fstack-protector-strong -fno-strict-aliasing -O2 -pipe -DNDEBUG -O3 -fstack-protector-strong -fno-strict-aliasing -Wall -Wextra -Wshadow -std=gnu++98 -fPIC -Wno-array-bounds -ffast-math -mstackrealign -fno-exceptions -MD -MT common/CMakeFiles/common.dir/md5.cpp.o -MF common/CMakeFiles/common.dir/md5.cpp.o.d -o common/CMakeFiles/common.dir/md5.cpp.o -c /wrkdirs/usr/ports/multimedia/x265/work/x265_3.2.1/source/common/md5.cpp
[12/51] /nxb-bin/usr/bin/c++ -DEXPORT_C_API=0 -DHAVE_INT_TYPES_H=1 -DHIGH_BIT_DEPTH=1 -DX265_DEPTH=12 -DX265_NS=x265_12bit -D__STDC_LIMIT_MACROS=1 -I/wrkdirs/usr/ports/multimedia/x265/work/x265_3.2.1/source/. -I/wrkdirs/usr/ports/multimedia/x265/work/x265_3.2.1/source/common -I/wrkdirs/usr/ports/multimedia/x265/work/x265_3.2.1/source/encoder -I. -O2 -pipe -DNDEBUG -O3 -fstack-protector-strong -fno-strict-aliasing -O2 -pipe -DNDEBUG -O3 -fstack-protector-strong -fno-strict-aliasing -Wall -Wextra -Wshadow -std=gnu++98 -fPIC -Wno-array-bounds -ffast-math -mstackrealign -fno-exceptions -MD -MT common/CMakeFiles/common.dir/shortyuv.cpp.o -MF common/CMakeFiles/common.dir/shortyuv.cpp.o.d -o common/CMakeFiles/common.dir/shortyuv.cpp.o -c /wrkdirs/usr/ports/multimedia/x265/work/x265_3.2.1/source/common/shortyuv.cpp
[13/51] /nxb-bin/usr/bin/c++ -DEXPORT_C_API=0 -DHAVE_INT_TYPES_H=1 -DHIGH_BIT_DEPTH=1 -DX265_DEPTH=12 -DX265_NS=x265_12bit -D__STDC_LIMIT_MACROS=1 -I/wrkdirs/usr/ports/multimedia/x265/work/x265_3.2.1/source/. -I/wrkdirs/usr/ports/multimedia/x265/work/x265_3.2.1/source/common -I/wrkdirs/usr/ports/multimedia/x265/work/x265_3.2.1/source/encoder -I. -O2 -pipe -DNDEBUG -O3 -fstack-protector-strong -fno-strict-aliasing -O2 -pipe -DNDEBUG -O3 -fstack-protector-strong -fno-strict-aliasing -Wall -Wextra -Wshadow -std=gnu++98 -fPIC -Wno-array-bounds -ffast-math -mstackrealign -fno-exceptions -MD -MT common/CMakeFiles/common.dir/intrapred.cpp.o -MF common/CMakeFiles/common.dir/intrapred.cpp.o.d -o common/CMakeFiles/common.dir/intrapred.cpp.o -c /wrkdirs/usr/ports/multimedia/x265/work/x265_3.2.1/source/common/intrapred.cpp
[14/51] /nxb-bin/usr/bin/c++ -DEXPORT_C_API=0 -DHAVE_INT_TYPES_H=1 -DHIGH_BIT_DEPTH=1 -DX265_DEPTH=12 -DX265_NS=x265_12bit -D__STDC_LIMIT_MACROS=1 -I/wrkdirs/usr/ports/multimedia/x265/work/x265_3.2.1/source/. -I/wrkdirs/usr/ports/multimedia/x265/work/x265_3.2.1/source/common -I/wrkdirs/usr/ports/multimedia/x265/work/x265_3.2.1/source/encoder -I. -O2 -pipe -DNDEBUG -O3 -fstack-protector-strong -fno-strict-aliasing -O2 -pipe -DNDEBUG -O3 -fstack-protector-strong -fno-strict-aliasing -Wall -Wextra -Wshadow -std=gnu++98 -fPIC -Wno-array-bounds -ffast-math -mstackrealign -fno-exceptions -MD -MT common/CMakeFiles/common.dir/common.cpp.o -MF common/CMakeFiles/common.dir/common.cpp.o.d -o common/CMakeFiles/common.dir/common.cpp.o -c /wrkdirs/usr/ports/multimedia/x265/work/x265_3.2.1/source/common/common.cpp
[15/51] /nxb-bin/usr/bin/c++ -DEXPORT_C_API=0 -DHAVE_INT_TYPES_H=1 -DHIGH_BIT_DEPTH=1 -DX265_DEPTH=12 -DX265_NS=x265_12bit -D__STDC_LIMIT_MACROS=1 -I/wrkdirs/usr/ports/multimedia/x265/work/x265_3.2.1/source/. -I/wrkdirs/usr/ports/multimedia/x265/work/x265_3.2.1/source/common -I/wrkdirs/usr/ports/multimedia/x265/work/x265_3.2.1/source/encoder -I. -O2 -pipe -DNDEBUG -O3 -fstack-protector-strong -fno-strict-aliasing -O2 -pipe -DNDEBUG -O3 -fstack-protector-strong -fno-strict-aliasing -Wall -Wextra -Wshadow -std=gnu++98 -fPIC -Wno-array-bounds -ffast-math -mstackrealign -fno-exceptions -MD -MT common/CMakeFiles/common.dir/threadpool.cpp.o -MF common/CMakeFiles/common.dir/threadpool.cpp.o.d -o common/CMakeFiles/common.dir/threadpool.cpp.o -c /wrkdirs/usr/ports/multimedia/x265/work/x265_3.2.1/source/common/threadpool.cpp
[16/51] /nxb-bin/usr/bin/c++ -DEXPORT_C_API=0 -DHAVE_INT_TYPES_H=1 -DHIGH_BIT_DEPTH=1 -DX265_DEPTH=12 -DX265_NS=x265_12bit -D__STDC_LIMIT_MACROS=1 -I/wrkdirs/usr/ports/multimedia/x265/work/x265_3.2.1/source/. -I/wrkdirs/usr/ports/multimedia/x265/work/x265_3.2.1/source/common -I/wrkdirs/usr/ports/multimedia/x265/work/x265_3.2.1/source/encoder -I. -O2 -pipe -DNDEBUG -O3 -fstack-protector-strong -fno-strict-aliasing -O2 -pipe -DNDEBUG -O3 -fstack-protector-strong -fno-strict-aliasing -Wall -Wextra -Wshadow -std=gnu++98 -fPIC -Wno-array-bounds -ffast-math -mstackrealign -fno-exceptions -MD -MT common/CMakeFiles/common.dir/dct.cpp.o -MF common/CMakeFiles/common.dir/dct.cpp.o.d -o common/CMakeFiles/common.dir/dct.cpp.o -c /wrkdirs/usr/ports/multimedia/x265/work/x265_3.2.1/source/common/dct.cpp
[17/51] /nxb-bin/usr/bin/c++ -DEXPORT_C_API=0 -DHAVE_INT_TYPES_H=1 -DHIGH_BIT_DEPTH=1 -DX265_DEPTH=12 -DX265_NS=x265_12bit -D__STDC_LIMIT_MACROS=1 -I/wrkdirs/usr/ports/multimedia/x265/work/x265_3.2.1/source/. -I/wrkdirs/usr/ports/multimedia/x265/work/x265_3.2.1/source/common -I/wrkdirs/usr/ports/multimedia/x265/work/x265_3.2.1/source/encoder -I. -O2 -pipe -DNDEBUG -O3 -fstack-protector-strong -fno-strict-aliasing -O2 -pipe -DNDEBUG -O3 -fstack-protector-strong -fno-strict-aliasing -Wall -Wextra -Wshadow -std=gnu++98 -fPIC -Wno-array-bounds -ffast-math -mstackrealign -fno-exceptions -MD -MT common/CMakeFiles/common.dir/picyuv.cpp.o -MF common/CMakeFiles/common.dir/picyuv.cpp.o.d -o common/CMakeFiles/common.dir/picyuv.cpp.o -c /wrkdirs/usr/ports/multimedia/x265/work/x265_3.2.1/source/common/picyuv.cpp
[18/51] /nxb-bin/usr/bin/c++ -DEXPORT_C_API=0 -DHAVE_INT_TYPES_H=1 -DHIGH_BIT_DEPTH=1 -DX265_DEPTH=12 -DX265_NS=x265_12bit -D__STDC_LIMIT_MACROS=1 -I/wrkdirs/usr/ports/multimedia/x265/work/x265_3.2.1/source/. -I/wrkdirs/usr/ports/multimedia/x265/work/x265_3.2.1/source/common -I/wrkdirs/usr/ports/multimedia/x265/work/x265_3.2.1/source/encoder -I. -O2 -pipe -DNDEBUG -O3 -fstack-protector-strong -fno-strict-aliasing -O2 -pipe -DNDEBUG -O3 -fstack-protector-strong -fno-strict-aliasing -Wall -Wextra -Wshadow -std=gnu++98 -fPIC -Wno-array-bounds -ffast-math -mstackrealign -fno-exceptions -MD -MT common/CMakeFiles/common.dir/frame.cpp.o -MF common/CMakeFiles/common.dir/frame.cpp.o.d -o common/CMakeFiles/common.dir/frame.cpp.o -c /wrkdirs/usr/ports/multimedia/x265/work/x265_3.2.1/source/common/frame.cpp
[19/51] /nxb-bin/usr/bin/c++ -DEXPORT_C_API=0 -DHAVE_INT_TYPES_H=1 -DHIGH_BIT_DEPTH=1 -DX265_DEPTH=12 -DX265_NS=x265_12bit -D__STDC_LIMIT_MACROS=1 -I/wrkdirs/usr/ports/multimedia/x265/work/x265_3.2.1/source/. -I/wrkdirs/usr/ports/multimedia/x265/work/x265_3.2.1/source/common -I/wrkdirs/usr/ports/multimedia/x265/work/x265_3.2.1/source/encoder -I. -O2 -pipe -DNDEBUG -O3 -fstack-protector-strong -fno-strict-aliasing -O2 -pipe -DNDEBUG -O3 -fstack-protector-strong -fno-strict-aliasing -Wall -Wextra -Wshadow -std=gnu++98 -fPIC -Wno-array-bounds -ffast-math -mstackrealign -fno-exceptions -MD -MT common/CMakeFiles/common.dir/lowres.cpp.o -MF common/CMakeFiles/common.dir/lowres.cpp.o.d -o common/CMakeFiles/common.dir/lowres.cpp.o -c /wrkdirs/usr/ports/multimedia/x265/work/x265_3.2.1/source/common/lowres.cpp
[20/51] /nxb-bin/usr/bin/c++ -DEXPORT_C_API=0 -DHAVE_INT_TYPES_H=1 -DHIGH_BIT_DEPTH=1 -DX265_DEPTH=12 -DX265_NS=x265_12bit -D__STDC_LIMIT_MACROS=1 -I/wrkdirs/usr/ports/multimedia/x265/work/x265_3.2.1/source/. -I/wrkdirs/usr/ports/multimedia/x265/work/x265_3.2.1/source/common -I/wrkdirs/usr/ports/multimedia/x265/work/x265_3.2.1/source/encoder -I. -O2 -pipe -DNDEBUG -O3 -fstack-protector-strong -fno-strict-aliasing -O2 -pipe -DNDEBUG -O3 -fstack-protector-strong -fno-strict-aliasing -Wall -Wextra -Wshadow -std=gnu++98 -fPIC -Wno-array-bounds -ffast-math -mstackrealign -fno-exceptions -MD -MT common/CMakeFiles/common.dir/framedata.cpp.o -MF common/CMakeFiles/common.dir/framedata.cpp.o.d -o common/CMakeFiles/common.dir/framedata.cpp.o -c /wrkdirs/usr/ports/multimedia/x265/work/x265_3.2.1/source/common/framedata.cpp
[21/51] /nxb-bin/usr/bin/c++ -DEXPORT_C_API=0 -DHAVE_INT_TYPES_H=1 -DHIGH_BIT_DEPTH=1 -DX265_DEPTH=12 -DX265_NS=x265_12bit -D__STDC_LIMIT_MACROS=1 -I/wrkdirs/usr/ports/multimedia/x265/work/x265_3.2.1/source/. -I/wrkdirs/usr/ports/multimedia/x265/work/x265_3.2.1/source/common -I/wrkdirs/usr/ports/multimedia/x265/work/x265_3.2.1/source/encoder -I. -O2 -pipe -DNDEBUG -O3 -fstack-protector-strong -fno-strict-aliasing -O2 -pipe -DNDEBUG -O3 -fstack-protector-strong -fno-strict-aliasing -Wall -Wextra -Wshadow -std=gnu++98 -fPIC -Wno-array-bounds -ffast-math -mstackrealign -fno-exceptions -MD -MT common/CMakeFiles/common.dir/slice.cpp.o -MF common/CMakeFiles/common.dir/slice.cpp.o.d -o common/CMakeFiles/common.dir/slice.cpp.o -c /wrkdirs/usr/ports/multimedia/x265/work/x265_3.2.1/source/common/slice.cpp
[22/51] /nxb-bin/usr/bin/c++ -DEXPORT_C_API=0 -DHAVE_INT_TYPES_H=1 -DHIGH_BIT_DEPTH=1 -DX265_DEPTH=12 -DX265_NS=x265_12bit -D__STDC_LIMIT_MACROS=1 -I/wrkdirs/usr/ports/multimedia/x265/work/x265_3.2.1/source/. -I/wrkdirs/usr/ports/multimedia/x265/work/x265_3.2.1/source/common -I/wrkdirs/usr/ports/multimedia/x265/work/x265_3.2.1/source/encoder -I. -O2 -pipe -DNDEBUG -O3 -fstack-protector-strong -fno-strict-aliasing -O2 -pipe -DNDEBUG -O3 -fstack-protector-strong -fno-strict-aliasing -Wall -Wextra -Wshadow -std=gnu++98 -fPIC -Wno-array-bounds -ffast-math -mstackrealign -fno-exceptions -MD -MT common/CMakeFiles/common.dir/piclist.cpp.o -MF common/CMakeFiles/common.dir/piclist.cpp.o.d -o common/CMakeFiles/common.dir/piclist.cpp.o -c /wrkdirs/usr/ports/multimedia/x265/work/x265_3.2.1/source/common/piclist.cpp
[23/51] /nxb-bin/usr/bin/c++ -DEXPORT_C_API=0 -DHAVE_INT_TYPES_H=1 -DHIGH_BIT_DEPTH=1 -DX265_DEPTH=12 -DX265_NS=x265_12bit -D__STDC_LIMIT_MACROS=1 -I/wrkdirs/usr/ports/multimedia/x265/work/x265_3.2.1/source/. -I/wrkdirs/usr/ports/multimedia/x265/work/x265_3.2.1/source/common -I/wrkdirs/usr/ports/multimedia/x265/work/x265_3.2.1/source/encoder -I. -O2 -pipe -DNDEBUG -O3 -fstack-protector-strong -fno-strict-aliasing -O2 -pipe -DNDEBUG -O3 -fstack-protector-strong -fno-strict-aliasing -Wall -Wextra -Wshadow -std=gnu++98 -fPIC -Wno-array-bounds -ffast-math -mstackrealign -fno-exceptions -MD -MT common/CMakeFiles/common.dir/cudata.cpp.o -MF common/CMakeFiles/common.dir/cudata.cpp.o.d -o common/CMakeFiles/common.dir/cudata.cpp.o -c /wrkdirs/usr/ports/multimedia/x265/work/x265_3.2.1/source/common/cudata.cpp
[24/51] /nxb-bin/usr/bin/c++ -DEXPORT_C_API=0 -DHAVE_INT_TYPES_H=1 -DHIGH_BIT_DEPTH=1 -DX265_DEPTH=12 -DX265_NS=x265_12bit -D__STDC_LIMIT_MACROS=1 -I/wrkdirs/usr/ports/multimedia/x265/work/x265_3.2.1/source/. -I/wrkdirs/usr/ports/multimedia/x265/work/x265_3.2.1/source/common -I/wrkdirs/usr/ports/multimedia/x265/work/x265_3.2.1/source/encoder -I. -O2 -pipe -DNDEBUG -O3 -fstack-protector-strong -fno-strict-aliasing -O2 -pipe -DNDEBUG -O3 -fstack-protector-strong -fno-strict-aliasing -Wall -Wextra -Wshadow -std=gnu++98 -fPIC -Wno-array-bounds -ffast-math -mstackrealign -fno-exceptions -MD -MT common/CMakeFiles/common.dir/scalinglist.cpp.o -MF common/CMakeFiles/common.dir/scalinglist.cpp.o.d -o common/CMakeFiles/common.dir/scalinglist.cpp.o -c /wrkdirs/usr/ports/multimedia/x265/work/x265_3.2.1/source/common/scalinglist.cpp
[25/51] /nxb-bin/usr/bin/c++ -DEXPORT_C_API=0 -DHAVE_INT_TYPES_H=1 -DHIGH_BIT_DEPTH=1 -DX265_DEPTH=12 -DX265_NS=x265_12bit -D__STDC_LIMIT_MACROS=1 -I/wrkdirs/usr/ports/multimedia/x265/work/x265_3.2.1/source/. -I/wrkdirs/usr/ports/multimedia/x265/work/x265_3.2.1/source/common -I/wrkdirs/usr/ports/multimedia/x265/work/x265_3.2.1/source/encoder -I. -O2 -pipe -DNDEBUG -O3 -fstack-protector-strong -fno-strict-aliasing -O2 -pipe -DNDEBUG -O3 -fstack-protector-strong -fno-strict-aliasing -Wall -Wextra -Wshadow -std=gnu++98 -fPIC -Wno-array-bounds -ffast-math -mstackrealign -fno-exceptions -DHAVE_STRTOK_R=1 -MD -MT common/CMakeFiles/common.dir/param.cpp.o -MF common/CMakeFiles/common.dir/param.cpp.o.d -o common/CMakeFiles/common.dir/param.cpp.o -c /wrkdirs/usr/ports/multimedia/x265/work/x265_3.2.1/source/common/param.cpp
[26/51] /nxb-bin/usr/bin/c++ -DEXPORT_C_API=0 -DHAVE_INT_TYPES_H=1 -DHIGH_BIT_DEPTH=1 -DX265_DEPTH=12 -DX265_NS=x265_12bit -D__STDC_LIMIT_MACROS=1 -I/wrkdirs/usr/ports/multimedia/x265/work/x265_3.2.1/source/. -I/wrkdirs/usr/ports/multimedia/x265/work/x265_3.2.1/source/common -I/wrkdirs/usr/ports/multimedia/x265/work/x265_3.2.1/source/encoder -I. -O2 -pipe -DNDEBUG -O3 -fstack-protector-strong -fno-strict-aliasing -O2 -pipe -DNDEBUG -O3 -fstack-protector-strong -fno-strict-aliasing -Wall -Wextra -Wshadow -std=gnu++98 -fPIC -Wno-array-bounds -ffast-math -mstackrealign -fno-exceptions -MD -MT common/CMakeFiles/common.dir/predict.cpp.o -MF common/CMakeFiles/common.dir/predict.cpp.o.d -o common/CMakeFiles/common.dir/predict.cpp.o -c /wrkdirs/usr/ports/multimedia/x265/work/x265_3.2.1/source/common/predict.cpp
In file included from /wrkdirs/usr/ports/multimedia/x265/work/x265_3.2.1/source/common/predict.cpp:29:
In file included from /wrkdirs/usr/ports/multimedia/x265/work/x265_3.2.1/source/common/predict.h:30:
In file included from /wrkdirs/usr/ports/multimedia/x265/work/x265_3.2.1/source/common/quant.h:29:
/wrkdirs/usr/ports/multimedia/x265/work/x265_3.2.1/source/common/scalinglist.h:36:12: warning: declaration shadows a variable in namespace 'x265_12bit' [-Wshadow]
enum { NUM_SIZES = 4 }; // 4x4, 8x8, 16x16, 32x32
^
/wrkdirs/usr/ports/multimedia/x265/work/x265_3.2.1/source/common/cudata.h:51:5: note: previous declaration is here
NUM_SIZES
^
1 warning generated.
[27/51] /nxb-bin/usr/bin/c++ -DEXPORT_C_API=0 -DHAVE_INT_TYPES_H=1 -DHIGH_BIT_DEPTH=1 -DX265_DEPTH=12 -DX265_NS=x265_12bit -D__STDC_LIMIT_MACROS=1 -I/wrkdirs/usr/ports/multimedia/x265/work/x265_3.2.1/source/. -I/wrkdirs/usr/ports/multimedia/x265/work/x265_3.2.1/source/common -I/wrkdirs/usr/ports/multimedia/x265/work/x265_3.2.1/source/encoder -I. -O2 -pipe -DNDEBUG -O3 -fstack-protector-strong -fno-strict-aliasing -O2 -pipe -DNDEBUG -O3 -fstack-protector-strong -fno-strict-aliasing -Wall -Wextra -Wshadow -std=gnu++98 -fPIC -Wno-array-bounds -ffast-math -mstackrealign -fno-exceptions -MD -MT common/CMakeFiles/common.dir/deblock.cpp.o -MF common/CMakeFiles/common.dir/deblock.cpp.o.d -o common/CMakeFiles/common.dir/deblock.cpp.o -c /wrkdirs/usr/ports/multimedia/x265/work/x265_3.2.1/source/common/deblock.cpp
[28/51] /nxb-bin/usr/bin/c++ -DEXPORT_C_API=0 -DHAVE_INT_TYPES_H=1 -DHIGH_BIT_DEPTH=1 -DX265_DEPTH=12 -DX265_NS=x265_12bit -D__STDC_LIMIT_MACROS=1 -I/wrkdirs/usr/ports/multimedia/x265/work/x265_3.2.1/source/. -I/wrkdirs/usr/ports/multimedia/x265/work/x265_3.2.1/source/common -I/wrkdirs/usr/ports/multimedia/x265/work/x265_3.2.1/source/encoder -I. -O2 -pipe -DNDEBUG -O3 -fstack-protector-strong -fno-strict-aliasing -O2 -pipe -DNDEBUG -O3 -fstack-protector-strong -fno-strict-aliasing -Wall -Wextra -Wshadow -std=gnu++98 -fPIC -Wno-array-bounds -ffast-math -mstackrealign -fno-exceptions -Wno-uninitialized -MD -MT encoder/CMakeFiles/encoder.dir/framefilter.cpp.o -MF encoder/CMakeFiles/encoder.dir/framefilter.cpp.o.d -o encoder/CMakeFiles/encoder.dir/framefilter.cpp.o -c /wrkdirs/usr/ports/multimedia/x265/work/x265_3.2.1/source/encoder/framefilter.cpp
In file included from /wrkdirs/usr/ports/multimedia/x265/work/x265_3.2.1/source/encoder/framefilter.cpp:28:
In file included from /wrkdirs/usr/ports/multimedia/x265/work/x265_3.2.1/source/encoder/encoder.h:30:
/wrkdirs/usr/ports/multimedia/x265/work/x265_3.2.1/source/common/scalinglist.h:36:12: warning: declaration shadows a variable in namespace 'x265_12bit' [-Wshadow]
enum { NUM_SIZES = 4 }; // 4x4, 8x8, 16x16, 32x32
^
/wrkdirs/usr/ports/multimedia/x265/work/x265_3.2.1/source/common/cudata.h:51:5: note: previous declaration is here
NUM_SIZES
^
1 warning generated.
[29/51] /nxb-bin/usr/bin/c++ -DEXPORT_C_API=0 -DHAVE_INT_TYPES_H=1 -DHIGH_BIT_DEPTH=1 -DX265_DEPTH=12 -DX265_NS=x265_12bit -D__STDC_LIMIT_MACROS=1 -I/wrkdirs/usr/ports/multimedia/x265/work/x265_3.2.1/source/. -I/wrkdirs/usr/ports/multimedia/x265/work/x265_3.2.1/source/common -I/wrkdirs/usr/ports/multimedia/x265/work/x265_3.2.1/source/encoder -I. -O2 -pipe -DNDEBUG -O3 -fstack-protector-strong -fno-strict-aliasing -O2 -pipe -DNDEBUG -O3 -fstack-protector-strong -fno-strict-aliasing -Wall -Wextra -Wshadow -std=gnu++98 -fPIC -Wno-array-bounds -ffast-math -mstackrealign -fno-exceptions -Wno-uninitialized -MD -MT encoder/CMakeFiles/encoder.dir/bitcost.cpp.o -MF encoder/CMakeFiles/encoder.dir/bitcost.cpp.o.d -o encoder/CMakeFiles/encoder.dir/bitcost.cpp.o -c /wrkdirs/usr/ports/multimedia/x265/work/x265_3.2.1/source/encoder/bitcost.cpp
[30/51] /nxb-bin/usr/bin/c++ -DEXPORT_C_API=0 -DHAVE_INT_TYPES_H=1 -DHIGH_BIT_DEPTH=1 -DX265_DEPTH=12 -DX265_NS=x265_12bit -D__STDC_LIMIT_MACROS=1 -I/wrkdirs/usr/ports/multimedia/x265/work/x265_3.2.1/source/. -I/wrkdirs/usr/ports/multimedia/x265/work/x265_3.2.1/source/common -I/wrkdirs/usr/ports/multimedia/x265/work/x265_3.2.1/source/encoder -I. -O2 -pipe -DNDEBUG -O3 -fstack-protector-strong -fno-strict-aliasing -O2 -pipe -DNDEBUG -O3 -fstack-protector-strong -fno-strict-aliasing -Wall -Wextra -Wshadow -std=gnu++98 -fPIC -Wno-array-bounds -ffast-math -mstackrealign -fno-exceptions -MD -MT common/CMakeFiles/common.dir/quant.cpp.o -MF common/CMakeFiles/common.dir/quant.cpp.o.d -o common/CMakeFiles/common.dir/quant.cpp.o -c /wrkdirs/usr/ports/multimedia/x265/work/x265_3.2.1/source/common/quant.cpp
[31/51] /nxb-bin/usr/bin/c++ -DEXPORT_C_API=0 -DHAVE_INT_TYPES_H=1 -DHIGH_BIT_DEPTH=1 -DX265_DEPTH=12 -DX265_NS=x265_12bit -D__STDC_LIMIT_MACROS=1 -I/wrkdirs/usr/ports/multimedia/x265/work/x265_3.2.1/source/. -I/wrkdirs/usr/ports/multimedia/x265/work/x265_3.2.1/source/common -I/wrkdirs/usr/ports/multimedia/x265/work/x265_3.2.1/source/encoder -I. -O2 -pipe -DNDEBUG -O3 -fstack-protector-strong -fno-strict-aliasing -O2 -pipe -DNDEBUG -O3 -fstack-protector-strong -fno-strict-aliasing -Wall -Wextra -Wshadow -std=gnu++98 -fPIC -Wno-array-bounds -ffast-math -mstackrealign -fno-exceptions -Wno-uninitialized -MD -MT encoder/CMakeFiles/encoder.dir/level.cpp.o -MF encoder/CMakeFiles/encoder.dir/level.cpp.o.d -o encoder/CMakeFiles/encoder.dir/level.cpp.o -c /wrkdirs/usr/ports/multimedia/x265/work/x265_3.2.1/source/encoder/level.cpp
[32/51] /nxb-bin/usr/bin/c++ -DEXPORT_C_API=0 -DHAVE_INT_TYPES_H=1 -DHIGH_BIT_DEPTH=1 -DX265_DEPTH=12 -DX265_NS=x265_12bit -D__STDC_LIMIT_MACROS=1 -I/wrkdirs/usr/ports/multimedia/x265/work/x265_3.2.1/source/. -I/wrkdirs/usr/ports/multimedia/x265/work/x265_3.2.1/source/common -I/wrkdirs/usr/ports/multimedia/x265/work/x265_3.2.1/source/encoder -I. -O2 -pipe -DNDEBUG -O3 -fstack-protector-strong -fno-strict-aliasing -O2 -pipe -DNDEBUG -O3 -fstack-protector-strong -fno-strict-aliasing -Wall -Wextra -Wshadow -std=gnu++98 -fPIC -Wno-array-bounds -ffast-math -mstackrealign -fno-exceptions -Wno-uninitialized -MD -MT encoder/CMakeFiles/encoder.dir/frameencoder.cpp.o -MF encoder/CMakeFiles/encoder.dir/frameencoder.cpp.o.d -o encoder/CMakeFiles/encoder.dir/frameencoder.cpp.o -c /wrkdirs/usr/ports/multimedia/x265/work/x265_3.2.1/source/encoder/frameencoder.cpp
In file included from /wrkdirs/usr/ports/multimedia/x265/work/x265_3.2.1/source/encoder/frameencoder.cpp:32:
In file included from /wrkdirs/usr/ports/multimedia/x265/work/x265_3.2.1/source/encoder/encoder.h:30:
/wrkdirs/usr/ports/multimedia/x265/work/x265_3.2.1/source/common/scalinglist.h:36:12: warning: declaration shadows a variable in namespace 'x265_12bit' [-Wshadow]
enum { NUM_SIZES = 4 }; // 4x4, 8x8, 16x16, 32x32
^
/wrkdirs/usr/ports/multimedia/x265/work/x265_3.2.1/source/common/cudata.h:51:5: note: previous declaration is here
NUM_SIZES
^
1 warning generated.
[33/51] /nxb-bin/usr/bin/c++ -DEXPORT_C_API=0 -DHAVE_INT_TYPES_H=1 -DHIGH_BIT_DEPTH=1 -DX265_DEPTH=12 -DX265_NS=x265_12bit -D__STDC_LIMIT_MACROS=1 -I/wrkdirs/usr/ports/multimedia/x265/work/x265_3.2.1/source/. -I/wrkdirs/usr/ports/multimedia/x265/work/x265_3.2.1/source/common -I/wrkdirs/usr/ports/multimedia/x265/work/x265_3.2.1/source/encoder -I. -O2 -pipe -DNDEBUG -O3 -fstack-protector-strong -fno-strict-aliasing -O2 -pipe -DNDEBUG -O3 -fstack-protector-strong -fno-strict-aliasing -Wall -Wextra -Wshadow -std=gnu++98 -fPIC -Wno-array-bounds -ffast-math -mstackrealign -fno-exceptions -Wno-uninitialized -Wno-strict-overflow -MD -MT encoder/CMakeFiles/encoder.dir/slicetype.cpp.o -MF encoder/CMakeFiles/encoder.dir/slicetype.cpp.o.d -o encoder/CMakeFiles/encoder.dir/slicetype.cpp.o -c /wrkdirs/usr/ports/multimedia/x265/work/x265_3.2.1/source/encoder/slicetype.cpp
[34/51] /nxb-bin/usr/bin/c++ -DEXPORT_C_API=0 -DHAVE_INT_TYPES_H=1 -DHIGH_BIT_DEPTH=1 -DX265_DEPTH=12 -DX265_NS=x265_12bit -D__STDC_LIMIT_MACROS=1 -I/wrkdirs/usr/ports/multimedia/x265/work/x265_3.2.1/source/. -I/wrkdirs/usr/ports/multimedia/x265/work/x265_3.2.1/source/common -I/wrkdirs/usr/ports/multimedia/x265/work/x265_3.2.1/source/encoder -I. -O2 -pipe -DNDEBUG -O3 -fstack-protector-strong -fno-strict-aliasing -O2 -pipe -DNDEBUG -O3 -fstack-protector-strong -fno-strict-aliasing -Wall -Wextra -Wshadow -std=gnu++98 -fPIC -Wno-array-bounds -ffast-math -mstackrealign -fno-exceptions -Wno-uninitialized -MD -MT encoder/CMakeFiles/encoder.dir/sei.cpp.o -MF encoder/CMakeFiles/encoder.dir/sei.cpp.o.d -o encoder/CMakeFiles/encoder.dir/sei.cpp.o -c /wrkdirs/usr/ports/multimedia/x265/work/x265_3.2.1/source/encoder/sei.cpp
[35/51] /nxb-bin/usr/bin/c++ -DEXPORT_C_API=0 -DHAVE_INT_TYPES_H=1 -DHIGH_BIT_DEPTH=1 -DX265_DEPTH=12 -DX265_NS=x265_12bit -D__STDC_LIMIT_MACROS=1 -I/wrkdirs/usr/ports/multimedia/x265/work/x265_3.2.1/source/. -I/wrkdirs/usr/ports/multimedia/x265/work/x265_3.2.1/source/common -I/wrkdirs/usr/ports/multimedia/x265/work/x265_3.2.1/source/encoder -I. -O2 -pipe -DNDEBUG -O3 -fstack-protector-strong -fno-strict-aliasing -O2 -pipe -DNDEBUG -O3 -fstack-protector-strong -fno-strict-aliasing -Wall -Wextra -Wshadow -std=gnu++98 -fPIC -Wno-array-bounds -ffast-math -mstackrealign -fno-exceptions -Wno-uninitialized -MD -MT encoder/CMakeFiles/encoder.dir/nal.cpp.o -MF encoder/CMakeFiles/encoder.dir/nal.cpp.o.d -o encoder/CMakeFiles/encoder.dir/nal.cpp.o -c /wrkdirs/usr/ports/multimedia/x265/work/x265_3.2.1/source/encoder/nal.cpp
[36/51] /nxb-bin/usr/bin/c++ -DEXPORT_C_API=0 -DHAVE_INT_TYPES_H=1 -DHIGH_BIT_DEPTH=1 -DX265_DEPTH=12 -DX265_NS=x265_12bit -D__STDC_LIMIT_MACROS=1 -I/wrkdirs/usr/ports/multimedia/x265/work/x265_3.2.1/source/. -I/wrkdirs/usr/ports/multimedia/x265/work/x265_3.2.1/source/common -I/wrkdirs/usr/ports/multimedia/x265/work/x265_3.2.1/source/encoder -I. -O2 -pipe -DNDEBUG -O3 -fstack-protector-strong -fno-strict-aliasing -O2 -pipe -DNDEBUG -O3 -fstack-protector-strong -fno-strict-aliasing -Wall -Wextra -Wshadow -std=gnu++98 -fPIC -Wno-array-bounds -ffast-math -mstackrealign -fno-exceptions -Wno-uninitialized -MD -MT encoder/CMakeFiles/encoder.dir/analysis.cpp.o -MF encoder/CMakeFiles/encoder.dir/analysis.cpp.o.d -o encoder/CMakeFiles/encoder.dir/analysis.cpp.o -c /wrkdirs/usr/ports/multimedia/x265/work/x265_3.2.1/source/encoder/analysis.cpp
In file included from /wrkdirs/usr/ports/multimedia/x265/work/x265_3.2.1/source/encoder/analysis.cpp:33:
In file included from /wrkdirs/usr/ports/multimedia/x265/work/x265_3.2.1/source/encoder/analysis.h:30:
In file included from /wrkdirs/usr/ports/multimedia/x265/work/x265_3.2.1/source/common/predict.h:30:
In file included from /wrkdirs/usr/ports/multimedia/x265/work/x265_3.2.1/source/common/quant.h:29:
/wrkdirs/usr/ports/multimedia/x265/work/x265_3.2.1/source/common/scalinglist.h:36:12: warning: declaration shadows a variable in namespace 'x265_12bit' [-Wshadow]
enum { NUM_SIZES = 4 }; // 4x4, 8x8, 16x16, 32x32
^
/wrkdirs/usr/ports/multimedia/x265/work/x265_3.2.1/source/common/cudata.h:51:5: note: previous declaration is here
NUM_SIZES
^
1 warning generated.
[37/51] /nxb-bin/usr/bin/c++ -DEXPORT_C_API=0 -DHAVE_INT_TYPES_H=1 -DHIGH_BIT_DEPTH=1 -DX265_DEPTH=12 -DX265_NS=x265_12bit -D__STDC_LIMIT_MACROS=1 -I/wrkdirs/usr/ports/multimedia/x265/work/x265_3.2.1/source/. -I/wrkdirs/usr/ports/multimedia/x265/work/x265_3.2.1/source/common -I/wrkdirs/usr/ports/multimedia/x265/work/x265_3.2.1/source/encoder -I. -O2 -pipe -DNDEBUG -O3 -fstack-protector-strong -fno-strict-aliasing -O2 -pipe -DNDEBUG -O3 -fstack-protector-strong -fno-strict-aliasing -Wall -Wextra -Wshadow -std=gnu++98 -fPIC -Wno-array-bounds -ffast-math -mstackrealign -fno-exceptions -Wno-uninitialized -MD -MT encoder/CMakeFiles/encoder.dir/motion.cpp.o -MF encoder/CMakeFiles/encoder.dir/motion.cpp.o.d -o encoder/CMakeFiles/encoder.dir/motion.cpp.o -c /wrkdirs/usr/ports/multimedia/x265/work/x265_3.2.1/source/encoder/motion.cpp
[38/51] /nxb-bin/usr/bin/c++ -DEXPORT_C_API=0 -DHAVE_INT_TYPES_H=1 -DHIGH_BIT_DEPTH=1 -DX265_DEPTH=12 -DX265_NS=x265_12bit -D__STDC_LIMIT_MACROS=1 -I/wrkdirs/usr/ports/multimedia/x265/work/x265_3.2.1/source/. -I/wrkdirs/usr/ports/multimedia/x265/work/x265_3.2.1/source/common -I/wrkdirs/usr/ports/multimedia/x265/work/x265_3.2.1/source/encoder -I. -O2 -pipe -DNDEBUG -O3 -fstack-protector-strong -fno-strict-aliasing -O2 -pipe -DNDEBUG -O3 -fstack-protector-strong -fno-strict-aliasing -Wall -Wextra -Wshadow -std=gnu++98 -fPIC -Wno-array-bounds -ffast-math -mstackrealign -fno-exceptions -Wno-uninitialized -MD -MT encoder/CMakeFiles/encoder.dir/search.cpp.o -MF encoder/CMakeFiles/encoder.dir/search.cpp.o.d -o encoder/CMakeFiles/encoder.dir/search.cpp.o -c /wrkdirs/usr/ports/multimedia/x265/work/x265_3.2.1/source/encoder/search.cpp
In file included from /wrkdirs/usr/ports/multimedia/x265/work/x265_3.2.1/source/encoder/search.cpp:30:
In file included from /wrkdirs/usr/ports/multimedia/x265/work/x265_3.2.1/source/encoder/search.h:29:
In file included from /wrkdirs/usr/ports/multimedia/x265/work/x265_3.2.1/source/common/predict.h:30:
In file included from /wrkdirs/usr/ports/multimedia/x265/work/x265_3.2.1/source/common/quant.h:29:
/wrkdirs/usr/ports/multimedia/x265/work/x265_3.2.1/source/common/scalinglist.h:36:12: warning: declaration shadows a variable in namespace 'x265_12bit' [-Wshadow]
enum { NUM_SIZES = 4 }; // 4x4, 8x8, 16x16, 32x32
^
/wrkdirs/usr/ports/multimedia/x265/work/x265_3.2.1/source/common/cudata.h:51:5: note: previous declaration is here
NUM_SIZES
^
1 warning generated.
[39/51] /nxb-bin/usr/bin/c++ -DEXPORT_C_API=0 -DHAVE_INT_TYPES_H=1 -DHIGH_BIT_DEPTH=1 -DX265_DEPTH=12 -DX265_NS=x265_12bit -D__STDC_LIMIT_MACROS=1 -I/wrkdirs/usr/ports/multimedia/x265/work/x265_3.2.1/source/. -I/wrkdirs/usr/ports/multimedia/x265/work/x265_3.2.1/source/common -I/wrkdirs/usr/ports/multimedia/x265/work/x265_3.2.1/source/encoder -I. -O2 -pipe -DNDEBUG -O3 -fstack-protector-strong -fno-strict-aliasing -O2 -pipe -DNDEBUG -O3 -fstack-protector-strong -fno-strict-aliasing -Wall -Wextra -Wshadow -std=gnu++98 -fPIC -Wno-array-bounds -ffast-math -mstackrealign -fno-exceptions -Wno-uninitialized -MD -MT encoder/CMakeFiles/encoder.dir/dpb.cpp.o -MF encoder/CMakeFiles/encoder.dir/dpb.cpp.o.d -o encoder/CMakeFiles/encoder.dir/dpb.cpp.o -c /wrkdirs/usr/ports/multimedia/x265/work/x265_3.2.1/source/encoder/dpb.cpp
[40/51] /nxb-bin/usr/bin/c++ -DEXPORT_C_API=0 -DHAVE_INT_TYPES_H=1 -DHIGH_BIT_DEPTH=1 -DX265_DEPTH=12 -DX265_NS=x265_12bit -D__STDC_LIMIT_MACROS=1 -I/wrkdirs/usr/ports/multimedia/x265/work/x265_3.2.1/source/. -I/wrkdirs/usr/ports/multimedia/x265/work/x265_3.2.1/source/common -I/wrkdirs/usr/ports/multimedia/x265/work/x265_3.2.1/source/encoder -I. -O2 -pipe -DNDEBUG -O3 -fstack-protector-strong -fno-strict-aliasing -O2 -pipe -DNDEBUG -O3 -fstack-protector-strong -fno-strict-aliasing -Wall -Wextra -Wshadow -std=gnu++98 -fPIC -Wno-array-bounds -ffast-math -mstackrealign -fno-exceptions -Wno-uninitialized -MD -MT encoder/CMakeFiles/encoder.dir/reference.cpp.o -MF encoder/CMakeFiles/encoder.dir/reference.cpp.o.d -o encoder/CMakeFiles/encoder.dir/reference.cpp.o -c /wrkdirs/usr/ports/multimedia/x265/work/x265_3.2.1/source/encoder/reference.cpp
[41/51] /nxb-bin/usr/bin/c++ -DEXPORT_C_API=0 -DHAVE_INT_TYPES_H=1 -DHIGH_BIT_DEPTH=1 -DX265_DEPTH=12 -DX265_NS=x265_12bit -D__STDC_LIMIT_MACROS=1 -I/wrkdirs/usr/ports/multimedia/x265/work/x265_3.2.1/source/. -I/wrkdirs/usr/ports/multimedia/x265/work/x265_3.2.1/source/common -I/wrkdirs/usr/ports/multimedia/x265/work/x265_3.2.1/source/encoder -I. -O2 -pipe -DNDEBUG -O3 -fstack-protector-strong -fno-strict-aliasing -O2 -pipe -DNDEBUG -O3 -fstack-protector-strong -fno-strict-aliasing -Wall -Wextra -Wshadow -std=gnu++98 -fPIC -Wno-array-bounds -ffast-math -mstackrealign -fno-exceptions -Wno-uninitialized -MD -MT encoder/CMakeFiles/encoder.dir/api.cpp.o -MF encoder/CMakeFiles/encoder.dir/api.cpp.o.d -o encoder/CMakeFiles/encoder.dir/api.cpp.o -c /wrkdirs/usr/ports/multimedia/x265/work/x265_3.2.1/source/encoder/api.cpp
[42/51] /nxb-bin/usr/bin/c++ -DEXPORT_C_API=0 -DHAVE_INT_TYPES_H=1 -DHIGH_BIT_DEPTH=1 -DX265_DEPTH=12 -DX265_NS=x265_12bit -D__STDC_LIMIT_MACROS=1 -I/wrkdirs/usr/ports/multimedia/x265/work/x265_3.2.1/source/. -I/wrkdirs/usr/ports/multimedia/x265/work/x265_3.2.1/source/common -I/wrkdirs/usr/ports/multimedia/x265/work/x265_3.2.1/source/encoder -I. -O2 -pipe -DNDEBUG -O3 -fstack-protector-strong -fno-strict-aliasing -O2 -pipe -DNDEBUG -O3 -fstack-protector-strong -fno-strict-aliasing -Wall -Wextra -Wshadow -std=gnu++98 -fPIC -Wno-array-bounds -ffast-math -mstackrealign -fno-exceptions -Wno-uninitialized -MD -MT encoder/CMakeFiles/encoder.dir/weightPrediction.cpp.o -MF encoder/CMakeFiles/encoder.dir/weightPrediction.cpp.o.d -o encoder/CMakeFiles/encoder.dir/weightPrediction.cpp.o -c /wrkdirs/usr/ports/multimedia/x265/work/x265_3.2.1/source/encoder/weightPrediction.cpp
[43/51] /nxb-bin/usr/bin/c++ -DEXPORT_C_API=0 -DHAVE_INT_TYPES_H=1 -DHIGH_BIT_DEPTH=1 -DX265_DEPTH=12 -DX265_NS=x265_12bit -D__STDC_LIMIT_MACROS=1 -I/wrkdirs/usr/ports/multimedia/x265/work/x265_3.2.1/source/. -I/wrkdirs/usr/ports/multimedia/x265/work/x265_3.2.1/source/common -I/wrkdirs/usr/ports/multimedia/x265/work/x265_3.2.1/source/encoder -I. -O2 -pipe -DNDEBUG -O3 -fstack-protector-strong -fno-strict-aliasing -O2 -pipe -DNDEBUG -O3 -fstack-protector-strong -fno-strict-aliasing -Wall -Wextra -Wshadow -std=gnu++98 -fPIC -Wno-array-bounds -ffast-math -mstackrealign -fno-exceptions -Wno-uninitialized -MD -MT encoder/CMakeFiles/encoder.dir/sao.cpp.o -MF encoder/CMakeFiles/encoder.dir/sao.cpp.o.d -o encoder/CMakeFiles/encoder.dir/sao.cpp.o -c /wrkdirs/usr/ports/multimedia/x265/work/x265_3.2.1/source/encoder/sao.cpp
[44/51] /nxb-bin/usr/bin/c++ -DEXPORT_C_API=0 -DHAVE_INT_TYPES_H=1 -DHIGH_BIT_DEPTH=1 -DX265_DEPTH=12 -DX265_NS=x265_12bit -D__STDC_LIMIT_MACROS=1 -I/wrkdirs/usr/ports/multimedia/x265/work/x265_3.2.1/source/. -I/wrkdirs/usr/ports/multimedia/x265/work/x265_3.2.1/source/common -I/wrkdirs/usr/ports/multimedia/x265/work/x265_3.2.1/source/encoder -I. -O2 -pipe -DNDEBUG -O3 -fstack-protector-strong -fno-strict-aliasing -O2 -pipe -DNDEBUG -O3 -fstack-protector-strong -fno-strict-aliasing -Wall -Wextra -Wshadow -std=gnu++98 -fPIC -Wno-array-bounds -ffast-math -mstackrealign -fno-exceptions -Wno-uninitialized -MD -MT encoder/CMakeFiles/encoder.dir/ratecontrol.cpp.o -MF encoder/CMakeFiles/encoder.dir/ratecontrol.cpp.o.d -o encoder/CMakeFiles/encoder.dir/ratecontrol.cpp.o -c /wrkdirs/usr/ports/multimedia/x265/work/x265_3.2.1/source/encoder/ratecontrol.cpp
In file included from /wrkdirs/usr/ports/multimedia/x265/work/x265_3.2.1/source/encoder/ratecontrol.cpp:36:
In file included from /wrkdirs/usr/ports/multimedia/x265/work/x265_3.2.1/source/encoder/encoder.h:30:
/wrkdirs/usr/ports/multimedia/x265/work/x265_3.2.1/source/common/scalinglist.h:36:12: warning: declaration shadows a variable in namespace 'x265_12bit' [-Wshadow]
enum { NUM_SIZES = 4 }; // 4x4, 8x8, 16x16, 32x32
^
/wrkdirs/usr/ports/multimedia/x265/work/x265_3.2.1/source/common/cudata.h:51:5: note: previous declaration is here
NUM_SIZES
^
1 warning generated.
[45/51] /nxb-bin/usr/bin/c++ -DEXPORT_C_API=0 -DHAVE_INT_TYPES_H=1 -DHIGH_BIT_DEPTH=1 -DX265_DEPTH=12 -DX265_NS=x265_12bit -D__STDC_LIMIT_MACROS=1 -I/wrkdirs/usr/ports/multimedia/x265/work/x265_3.2.1/source/. -I/wrkdirs/usr/ports/multimedia/x265/work/x265_3.2.1/source/common -I/wrkdirs/usr/ports/multimedia/x265/work/x265_3.2.1/source/encoder -I. -O2 -pipe -DNDEBUG -O3 -fstack-protector-strong -fno-strict-aliasing -O2 -pipe -DNDEBUG -O3 -fstack-protector-strong -fno-strict-aliasing -Wall -Wextra -Wshadow -std=gnu++98 -fPIC -Wno-array-bounds -ffast-math -mstackrealign -fno-exceptions -MD -MT common/CMakeFiles/common.dir/pixel.cpp.o -MF common/CMakeFiles/common.dir/pixel.cpp.o.d -o common/CMakeFiles/common.dir/pixel.cpp.o -c /wrkdirs/usr/ports/multimedia/x265/work/x265_3.2.1/source/common/pixel.cpp
[46/51] /nxb-bin/usr/bin/c++ -DEXPORT_C_API=0 -DHAVE_INT_TYPES_H=1 -DHIGH_BIT_DEPTH=1 -DX265_DEPTH=12 -DX265_NS=x265_12bit -D__STDC_LIMIT_MACROS=1 -I/wrkdirs/usr/ports/multimedia/x265/work/x265_3.2.1/source/. -I/wrkdirs/usr/ports/multimedia/x265/work/x265_3.2.1/source/common -I/wrkdirs/usr/ports/multimedia/x265/work/x265_3.2.1/source/encoder -I. -O2 -pipe -DNDEBUG -O3 -fstack-protector-strong -fno-strict-aliasing -O2 -pipe -DNDEBUG -O3 -fstack-protector-strong -fno-strict-aliasing -Wall -Wextra -Wshadow -std=gnu++98 -fPIC -Wno-array-bounds -ffast-math -mstackrealign -fno-exceptions -Wno-uninitialized -MD -MT encoder/CMakeFiles/encoder.dir/entropy.cpp.o -MF encoder/CMakeFiles/encoder.dir/entropy.cpp.o.d -o encoder/CMakeFiles/encoder.dir/entropy.cpp.o -c /wrkdirs/usr/ports/multimedia/x265/work/x265_3.2.1/source/encoder/entropy.cpp
In file included from /wrkdirs/usr/ports/multimedia/x265/work/x265_3.2.1/source/encoder/entropy.cpp:27:
/wrkdirs/usr/ports/multimedia/x265/work/x265_3.2.1/source/common/scalinglist.h:36:12: warning: declaration shadows a variable in namespace 'x265_12bit' [-Wshadow]
enum { NUM_SIZES = 4 }; // 4x4, 8x8, 16x16, 32x32
^
/wrkdirs/usr/ports/multimedia/x265/work/x265_3.2.1/source/common/cudata.h:51:5: note: previous declaration is here
NUM_SIZES
^
1 warning generated.
[47/51] /nxb-bin/usr/bin/c++ -DEXPORT_C_API=0 -DHAVE_INT_TYPES_H=1 -DHIGH_BIT_DEPTH=1 -DX265_DEPTH=12 -DX265_NS=x265_12bit -D__STDC_LIMIT_MACROS=1 -I/wrkdirs/usr/ports/multimedia/x265/work/x265_3.2.1/source/. -I/wrkdirs/usr/ports/multimedia/x265/work/x265_3.2.1/source/common -I/wrkdirs/usr/ports/multimedia/x265/work/x265_3.2.1/source/encoder -I. -O2 -pipe -DNDEBUG -O3 -fstack-protector-strong -fno-strict-aliasing -O2 -pipe -DNDEBUG -O3 -fstack-protector-strong -fno-strict-aliasing -Wall -Wextra -Wshadow -std=gnu++98 -fPIC -Wno-array-bounds -ffast-math -mstackrealign -fno-exceptions -Wno-uninitialized -MD -MT encoder/CMakeFiles/encoder.dir/encoder.cpp.o -MF encoder/CMakeFiles/encoder.dir/encoder.cpp.o.d -o encoder/CMakeFiles/encoder.dir/encoder.cpp.o -c /wrkdirs/usr/ports/multimedia/x265/work/x265_3.2.1/source/encoder/encoder.cpp
In file included from /wrkdirs/usr/ports/multimedia/x265/work/x265_3.2.1/source/encoder/encoder.cpp:36:
In file included from /wrkdirs/usr/ports/multimedia/x265/work/x265_3.2.1/source/encoder/encoder.h:30:
/wrkdirs/usr/ports/multimedia/x265/work/x265_3.2.1/source/common/scalinglist.h:36:12: warning: declaration shadows a variable in namespace 'x265_12bit' [-Wshadow]
enum { NUM_SIZES = 4 }; // 4x4, 8x8, 16x16, 32x32
^
/wrkdirs/usr/ports/multimedia/x265/work/x265_3.2.1/source/common/cudata.h:51:5: note: previous declaration is here
NUM_SIZES
^
1 warning generated.
[48/51] /nxb-bin/usr/bin/c++ -DEXPORT_C_API=0 -DHAVE_INT_TYPES_H=1 -DHIGH_BIT_DEPTH=1 -DX265_DEPTH=12 -DX265_NS=x265_12bit -D__STDC_LIMIT_MACROS=1 -I/wrkdirs/usr/ports/multimedia/x265/work/x265_3.2.1/source/. -I/wrkdirs/usr/ports/multimedia/x265/work/x265_3.2.1/source/common -I/wrkdirs/usr/ports/multimedia/x265/work/x265_3.2.1/source/encoder -I. -O2 -pipe -DNDEBUG -O3 -fstack-protector-strong -fno-strict-aliasing -O2 -pipe -DNDEBUG -O3 -fstack-protector-strong -fno-strict-aliasing -Wall -Wextra -Wshadow -std=gnu++98 -fPIC -Wno-array-bounds -ffast-math -mstackrealign -fno-exceptions -MD -MT common/CMakeFiles/common.dir/ipfilter.cpp.o -MF common/CMakeFiles/common.dir/ipfilter.cpp.o.d -o common/CMakeFiles/common.dir/ipfilter.cpp.o -c /wrkdirs/usr/ports/multimedia/x265/work/x265_3.2.1/source/common/ipfilter.cpp
[49/51] : && /nxb-bin/usr/bin/c++ -fPIC -O2 -pipe -DNDEBUG -O3 -fstack-protector-strong -fno-strict-aliasing -O2 -pipe -DNDEBUG -O3 -fstack-protector-strong -fno-strict-aliasing -fstack-protector-strong -Wl,-Bsymbolic,-znoexecstack -shared -Wl,-soname,libx265.so.179 -o libx265.so.179 encoder/CMakeFiles/encoder.dir/analysis.cpp.o encoder/CMakeFiles/encoder.dir/search.cpp.o encoder/CMakeFiles/encoder.dir/bitcost.cpp.o encoder/CMakeFiles/encoder.dir/motion.cpp.o encoder/CMakeFiles/encoder.dir/slicetype.cpp.o encoder/CMakeFiles/encoder.dir/frameencoder.cpp.o encoder/CMakeFiles/encoder.dir/framefilter.cpp.o encoder/CMakeFiles/encoder.dir/level.cpp.o encoder/CMakeFiles/encoder.dir/nal.cpp.o encoder/CMakeFiles/encoder.dir/sei.cpp.o encoder/CMakeFiles/encoder.dir/sao.cpp.o encoder/CMakeFiles/encoder.dir/entropy.cpp.o encoder/CMakeFiles/encoder.dir/dpb.cpp.o encoder/CMakeFiles/encoder.dir/ratecontrol.cpp.o encoder/CMakeFiles/encoder.dir/reference.cpp.o encoder/CMakeFiles/encoder.dir/encoder.cpp.o encoder/CMakeFiles/encoder.dir/api.cpp.o encoder/CMakeFiles/encoder.dir/weightPrediction.cpp.o common/CMakeFiles/common.dir/primitives.cpp.o common/CMakeFiles/common.dir/pixel.cpp.o common/CMakeFiles/common.dir/dct.cpp.o common/CMakeFiles/common.dir/lowpassdct.cpp.o common/CMakeFiles/common.dir/ipfilter.cpp.o common/CMakeFiles/common.dir/intrapred.cpp.o common/CMakeFiles/common.dir/loopfilter.cpp.o common/CMakeFiles/common.dir/constants.cpp.o common/CMakeFiles/common.dir/cpu.cpp.o common/CMakeFiles/common.dir/version.cpp.o common/CMakeFiles/common.dir/threading.cpp.o common/CMakeFiles/common.dir/threadpool.cpp.o common/CMakeFiles/common.dir/wavefront.cpp.o common/CMakeFiles/common.dir/md5.cpp.o common/CMakeFiles/common.dir/bitstream.cpp.o common/CMakeFiles/common.dir/yuv.cpp.o common/CMakeFiles/common.dir/shortyuv.cpp.o common/CMakeFiles/common.dir/picyuv.cpp.o common/CMakeFiles/common.dir/common.cpp.o common/CMakeFiles/common.dir/param.cpp.o common/CMakeFiles/common.dir/frame.cpp.o common/CMakeFiles/common.dir/framedata.cpp.o common/CMakeFiles/common.dir/cudata.cpp.o common/CMakeFiles/common.dir/slice.cpp.o common/CMakeFiles/common.dir/lowres.cpp.o common/CMakeFiles/common.dir/piclist.cpp.o common/CMakeFiles/common.dir/predict.cpp.o common/CMakeFiles/common.dir/scalinglist.cpp.o common/CMakeFiles/common.dir/quant.cpp.o common/CMakeFiles/common.dir/deblock.cpp.o -lpthread -lrt -ldl && :
[50/51] : && /usr/local/bin/cmake -E remove libx265.a && /nxb-bin/usr/bin/ar qc libx265.a encoder/CMakeFiles/encoder.dir/analysis.cpp.o encoder/CMakeFiles/encoder.dir/search.cpp.o encoder/CMakeFiles/encoder.dir/bitcost.cpp.o encoder/CMakeFiles/encoder.dir/motion.cpp.o encoder/CMakeFiles/encoder.dir/slicetype.cpp.o encoder/CMakeFiles/encoder.dir/frameencoder.cpp.o encoder/CMakeFiles/encoder.dir/framefilter.cpp.o encoder/CMakeFiles/encoder.dir/level.cpp.o encoder/CMakeFiles/encoder.dir/nal.cpp.o encoder/CMakeFiles/encoder.dir/sei.cpp.o encoder/CMakeFiles/encoder.dir/sao.cpp.o encoder/CMakeFiles/encoder.dir/entropy.cpp.o encoder/CMakeFiles/encoder.dir/dpb.cpp.o encoder/CMakeFiles/encoder.dir/ratecontrol.cpp.o encoder/CMakeFiles/encoder.dir/reference.cpp.o encoder/CMakeFiles/encoder.dir/encoder.cpp.o encoder/CMakeFiles/encoder.dir/api.cpp.o encoder/CMakeFiles/encoder.dir/weightPrediction.cpp.o common/CMakeFiles/common.dir/primitives.cpp.o common/CMakeFiles/common.dir/pixel.cpp.o common/CMakeFiles/common.dir/dct.cpp.o common/CMakeFiles/common.dir/lowpassdct.cpp.o common/CMakeFiles/common.dir/ipfilter.cpp.o common/CMakeFiles/common.dir/intrapred.cpp.o common/CMakeFiles/common.dir/loopfilter.cpp.o common/CMakeFiles/common.dir/constants.cpp.o common/CMakeFiles/common.dir/cpu.cpp.o common/CMakeFiles/common.dir/version.cpp.o common/CMakeFiles/common.dir/threading.cpp.o common/CMakeFiles/common.dir/threadpool.cpp.o common/CMakeFiles/common.dir/wavefront.cpp.o common/CMakeFiles/common.dir/md5.cpp.o common/CMakeFiles/common.dir/bitstream.cpp.o common/CMakeFiles/common.dir/yuv.cpp.o common/CMakeFiles/common.dir/shortyuv.cpp.o common/CMakeFiles/common.dir/picyuv.cpp.o common/CMakeFiles/common.dir/common.cpp.o common/CMakeFiles/common.dir/param.cpp.o common/CMakeFiles/common.dir/frame.cpp.o common/CMakeFiles/common.dir/framedata.cpp.o common/CMakeFiles/common.dir/cudata.cpp.o common/CMakeFiles/common.dir/slice.cpp.o common/CMakeFiles/common.dir/lowres.cpp.o common/CMakeFiles/common.dir/piclist.cpp.o common/CMakeFiles/common.dir/predict.cpp.o common/CMakeFiles/common.dir/scalinglist.cpp.o common/CMakeFiles/common.dir/quant.cpp.o common/CMakeFiles/common.dir/deblock.cpp.o && /nxb-bin/usr/bin/ranlib libx265.a && :
[51/51] /usr/local/bin/cmake -E cmake_symlink_library libx265.so.179 libx265.so.179 libx265.so && :
/bin/ln /wrkdirs/usr/ports/multimedia/x265/work/x265_3.2.1/12bit/libx265.a /wrkdirs/usr/ports/multimedia/x265/work/x265_3.2.1/12bit/libx265_12bit.a
echo "---> Built the 12-bit library ---"
---> Built the 12-bit library ---
[1/74] /nxb-bin/usr/bin/c++ -DENABLE_HDR10_PLUS -DEXPORT_C_API=1 -DHAVE_INT_TYPES_H=1 -DHIGH_BIT_DEPTH=0 -DX265_DEPTH=8 -DX265_NS=x265 -D__STDC_LIMIT_MACROS=1 -I/wrkdirs/usr/ports/multimedia/x265/work/x265_3.2.1/source/. -I/wrkdirs/usr/ports/multimedia/x265/work/x265_3.2.1/source/dynamicHDR10 -I. -I/wrkdirs/usr/ports/multimedia/x265/work/x265_3.2.1/source/common -I/wrkdirs/usr/ports/multimedia/x265/work/x265_3.2.1/source/encoder -O2 -pipe -DNDEBUG -O3 -fstack-protector-strong -fno-strict-aliasing -O2 -pipe -DNDEBUG -O3 -fstack-protector-strong -fno-strict-aliasing -Wall -Wextra -Wshadow -std=gnu++11 -fPIC -Wno-array-bounds -ffast-math -mstackrealign -fno-exceptions -Wno-narrowing -MD -MT common/CMakeFiles/common.dir/cpu.cpp.o -MF common/CMakeFiles/common.dir/cpu.cpp.o.d -o common/CMakeFiles/common.dir/cpu.cpp.o -c /wrkdirs/usr/ports/multimedia/x265/work/x265_3.2.1/source/common/cpu.cpp
/wrkdirs/usr/ports/multimedia/x265/work/x265_3.2.1/source/common/cpu.cpp:387:26: warning: unused parameter 'benableavx512' [-Wunused-parameter]
uint32_t cpu_detect(bool benableavx512)
^
/wrkdirs/usr/ports/multimedia/x265/work/x265_3.2.1/source/common/cpu.cpp:61:13: warning: unused variable 'enable512' [-Wunused-variable]
static bool enable512 = false;
^
2 warnings generated.
[2/74] /nxb-bin/usr/bin/c++ -DENABLE_HDR10_PLUS -DEXPORT_C_API=1 -DHAVE_INT_TYPES_H=1 -DHIGH_BIT_DEPTH=0 -DX265_DEPTH=8 -DX265_NS=x265 -D__STDC_LIMIT_MACROS=1 -I/wrkdirs/usr/ports/multimedia/x265/work/x265_3.2.1/source/. -I/wrkdirs/usr/ports/multimedia/x265/work/x265_3.2.1/source/dynamicHDR10 -I. -I/wrkdirs/usr/ports/multimedia/x265/work/x265_3.2.1/source/common -I/wrkdirs/usr/ports/multimedia/x265/work/x265_3.2.1/source/encoder -O2 -pipe -DNDEBUG -O3 -fstack-protector-strong -fno-strict-aliasing -O2 -pipe -DNDEBUG -O3 -fstack-protector-strong -fno-strict-aliasing -Wall -Wextra -Wshadow -std=gnu++11 -fPIC -Wno-array-bounds -ffast-math -mstackrealign -fno-exceptions -DX265_VERSION=3.2.1+1-b5c86a64bbbe -DLINKED_10BIT=1 -DLINKED_12BIT=1 -DENABLE_ASSEMBLY=1 -MD -MT common/CMakeFiles/common.dir/version.cpp.o -MF common/CMakeFiles/common.dir/version.cpp.o.d -o common/CMakeFiles/common.dir/version.cpp.o -c /wrkdirs/usr/ports/multimedia/x265/work/x265_3.2.1/source/common/version.cpp
[3/74] /nxb-bin/usr/bin/c++ -DENABLE_HDR10_PLUS -DEXPORT_C_API=1 -DHAVE_INT_TYPES_H=1 -DHIGH_BIT_DEPTH=0 -DX265_DEPTH=8 -DX265_NS=x265 -D__STDC_LIMIT_MACROS=1 -I/wrkdirs/usr/ports/multimedia/x265/work/x265_3.2.1/source/. -I/wrkdirs/usr/ports/multimedia/x265/work/x265_3.2.1/source/dynamicHDR10 -I. -I/wrkdirs/usr/ports/multimedia/x265/work/x265_3.2.1/source/common -I/wrkdirs/usr/ports/multimedia/x265/work/x265_3.2.1/source/encoder -O2 -pipe -DNDEBUG -O3 -fstack-protector-strong -fno-strict-aliasing -O2 -pipe -DNDEBUG -O3 -fstack-protector-strong -fno-strict-aliasing -Wall -Wextra -Wshadow -std=gnu++11 -fPIC -Wno-array-bounds -ffast-math -mstackrealign -fno-exceptions -DENABLE_ASSEMBLY=1 -MD -MT common/CMakeFiles/common.dir/threading.cpp.o -MF common/CMakeFiles/common.dir/threading.cpp.o.d -o common/CMakeFiles/common.dir/threading.cpp.o -c /wrkdirs/usr/ports/multimedia/x265/work/x265_3.2.1/source/common/threading.cpp
[4/74] /nxb-bin/usr/bin/c++ -DENABLE_HDR10_PLUS -DEXPORT_C_API=1 -DHAVE_INT_TYPES_H=1 -DHIGH_BIT_DEPTH=0 -DX265_DEPTH=8 -DX265_NS=x265 -D__STDC_LIMIT_MACROS=1 -I/wrkdirs/usr/ports/multimedia/x265/work/x265_3.2.1/source/. -I/wrkdirs/usr/ports/multimedia/x265/work/x265_3.2.1/source/dynamicHDR10 -I. -I/wrkdirs/usr/ports/multimedia/x265/work/x265_3.2.1/source/common -I/wrkdirs/usr/ports/multimedia/x265/work/x265_3.2.1/source/encoder -O2 -pipe -DNDEBUG -O3 -fstack-protector-strong -fno-strict-aliasing -O2 -pipe -DNDEBUG -O3 -fstack-protector-strong -fno-strict-aliasing -Wall -Wextra -Wshadow -std=gnu++11 -fPIC -Wno-array-bounds -ffast-math -mstackrealign -fno-exceptions -MD -MT common/CMakeFiles/common.dir/wavefront.cpp.o -MF common/CMakeFiles/common.dir/wavefront.cpp.o.d -o common/CMakeFiles/common.dir/wavefront.cpp.o -c /wrkdirs/usr/ports/multimedia/x265/work/x265_3.2.1/source/common/wavefront.cpp
[5/74] /nxb-bin/usr/bin/c++ -DENABLE_HDR10_PLUS -DEXPORT_C_API=1 -DHAVE_INT_TYPES_H=1 -DHIGH_BIT_DEPTH=0 -DX265_DEPTH=8 -DX265_NS=x265 -D__STDC_LIMIT_MACROS=1 -I/wrkdirs/usr/ports/multimedia/x265/work/x265_3.2.1/source/. -I/wrkdirs/usr/ports/multimedia/x265/work/x265_3.2.1/source/dynamicHDR10 -I. -I/wrkdirs/usr/ports/multimedia/x265/work/x265_3.2.1/source/common -I/wrkdirs/usr/ports/multimedia/x265/work/x265_3.2.1/source/encoder -O2 -pipe -DNDEBUG -O3 -fstack-protector-strong -fno-strict-aliasing -O2 -pipe -DNDEBUG -O3 -fstack-protector-strong -fno-strict-aliasing -Wall -Wextra -Wshadow -std=gnu++11 -fPIC -Wno-array-bounds -ffast-math -mstackrealign -fno-exceptions -MD -MT common/CMakeFiles/common.dir/shortyuv.cpp.o -MF common/CMakeFiles/common.dir/shortyuv.cpp.o.d -o common/CMakeFiles/common.dir/shortyuv.cpp.o -c /wrkdirs/usr/ports/multimedia/x265/work/x265_3.2.1/source/common/shortyuv.cpp
[6/74] /nxb-bin/usr/bin/c++ -DENABLE_HDR10_PLUS -DEXPORT_C_API=1 -DHAVE_INT_TYPES_H=1 -DHIGH_BIT_DEPTH=0 -DX265_DEPTH=8 -DX265_NS=x265 -D__STDC_LIMIT_MACROS=1 -I/wrkdirs/usr/ports/multimedia/x265/work/x265_3.2.1/source/. -I/wrkdirs/usr/ports/multimedia/x265/work/x265_3.2.1/source/dynamicHDR10 -I. -I/wrkdirs/usr/ports/multimedia/x265/work/x265_3.2.1/source/common -I/wrkdirs/usr/ports/multimedia/x265/work/x265_3.2.1/source/encoder -O2 -pipe -DNDEBUG -O3 -fstack-protector-strong -fno-strict-aliasing -O2 -pipe -DNDEBUG -O3 -fstack-protector-strong -fno-strict-aliasing -Wall -Wextra -Wshadow -std=gnu++11 -fPIC -Wno-array-bounds -ffast-math -mstackrealign -fno-exceptions -MD -MT common/CMakeFiles/common.dir/bitstream.cpp.o -MF common/CMakeFiles/common.dir/bitstream.cpp.o.d -o common/CMakeFiles/common.dir/bitstream.cpp.o -c /wrkdirs/usr/ports/multimedia/x265/work/x265_3.2.1/source/common/bitstream.cpp
[7/74] /nxb-bin/usr/bin/c++ -DENABLE_HDR10_PLUS -DEXPORT_C_API=1 -DHAVE_INT_TYPES_H=1 -DHIGH_BIT_DEPTH=0 -DX265_DEPTH=8 -DX265_NS=x265 -D__STDC_LIMIT_MACROS=1 -I/wrkdirs/usr/ports/multimedia/x265/work/x265_3.2.1/source/. -I/wrkdirs/usr/ports/multimedia/x265/work/x265_3.2.1/source/dynamicHDR10 -I. -I/wrkdirs/usr/ports/multimedia/x265/work/x265_3.2.1/source/common -I/wrkdirs/usr/ports/multimedia/x265/work/x265_3.2.1/source/encoder -O2 -pipe -DNDEBUG -O3 -fstack-protector-strong -fno-strict-aliasing -O2 -pipe -DNDEBUG -O3 -fstack-protector-strong -fno-strict-aliasing -Wall -Wextra -Wshadow -std=gnu++11 -fPIC -Wno-array-bounds -ffast-math -mstackrealign -fno-exceptions -MD -MT common/CMakeFiles/common.dir/threadpool.cpp.o -MF common/CMakeFiles/common.dir/threadpool.cpp.o.d -o common/CMakeFiles/common.dir/threadpool.cpp.o -c /wrkdirs/usr/ports/multimedia/x265/work/x265_3.2.1/source/common/threadpool.cpp
[8/74] /nxb-bin/usr/bin/c++ -DENABLE_HDR10_PLUS -DEXPORT_C_API=1 -DHAVE_INT_TYPES_H=1 -DHIGH_BIT_DEPTH=0 -DX265_DEPTH=8 -DX265_NS=x265 -D__STDC_LIMIT_MACROS=1 -I/wrkdirs/usr/ports/multimedia/x265/work/x265_3.2.1/source/. -I/wrkdirs/usr/ports/multimedia/x265/work/x265_3.2.1/source/dynamicHDR10 -I. -I/wrkdirs/usr/ports/multimedia/x265/work/x265_3.2.1/source/common -I/wrkdirs/usr/ports/multimedia/x265/work/x265_3.2.1/source/encoder -O2 -pipe -DNDEBUG -O3 -fstack-protector-strong -fno-strict-aliasing -O2 -pipe -DNDEBUG -O3 -fstack-protector-strong -fno-strict-aliasing -Wall -Wextra -Wshadow -std=gnu++11 -fPIC -Wno-array-bounds -ffast-math -mstackrealign -fno-exceptions -MD -MT common/CMakeFiles/common.dir/md5.cpp.o -MF common/CMakeFiles/common.dir/md5.cpp.o.d -o common/CMakeFiles/common.dir/md5.cpp.o -c /wrkdirs/usr/ports/multimedia/x265/work/x265_3.2.1/source/common/md5.cpp
/wrkdirs/usr/ports/multimedia/x265/work/x265_3.2.1/source/common/md5.cpp:188:5: warning: 'register' storage class specifier is deprecated and incompatible with C++17 [-Wdeprecated-register]
register uint32_t a, b, c, d;
^~~~~~~~~
/wrkdirs/usr/ports/multimedia/x265/work/x265_3.2.1/source/common/md5.cpp:188:5: warning: 'register' storage class specifier is deprecated and incompatible with C++17 [-Wdeprecated-register]
register uint32_t a, b, c, d;
^~~~~~~~~
/wrkdirs/usr/ports/multimedia/x265/work/x265_3.2.1/source/common/md5.cpp:188:5: warning: 'register' storage class specifier is deprecated and incompatible with C++17 [-Wdeprecated-register]
register uint32_t a, b, c, d;
^~~~~~~~~
/wrkdirs/usr/ports/multimedia/x265/work/x265_3.2.1/source/common/md5.cpp:188:5: warning: 'register' storage class specifier is deprecated and incompatible with C++17 [-Wdeprecated-register]
register uint32_t a, b, c, d;
^~~~~~~~~
4 warnings generated.
[9/74] /nxb-bin/usr/bin/c++ -DENABLE_HDR10_PLUS -DEXPORT_C_API=1 -DHAVE_INT_TYPES_H=1 -DHIGH_BIT_DEPTH=0 -DX265_DEPTH=8 -DX265_NS=x265 -D__STDC_LIMIT_MACROS=1 -I/wrkdirs/usr/ports/multimedia/x265/work/x265_3.2.1/source/. -I/wrkdirs/usr/ports/multimedia/x265/work/x265_3.2.1/source/dynamicHDR10 -I. -I/wrkdirs/usr/ports/multimedia/x265/work/x265_3.2.1/source/common -I/wrkdirs/usr/ports/multimedia/x265/work/x265_3.2.1/source/encoder -O2 -pipe -DNDEBUG -O3 -fstack-protector-strong -fno-strict-aliasing -O2 -pipe -DNDEBUG -O3 -fstack-protector-strong -fno-strict-aliasing -Wall -Wextra -Wshadow -std=gnu++11 -fPIC -Wno-array-bounds -ffast-math -mstackrealign -fno-exceptions -MD -MT common/CMakeFiles/common.dir/common.cpp.o -MF common/CMakeFiles/common.dir/common.cpp.o.d -o common/CMakeFiles/common.dir/common.cpp.o -c /wrkdirs/usr/ports/multimedia/x265/work/x265_3.2.1/source/common/common.cpp
[10/74] /nxb-bin/usr/bin/c++ -DENABLE_HDR10_PLUS -DEXPORT_C_API=1 -DHAVE_INT_TYPES_H=1 -DHIGH_BIT_DEPTH=0 -DX265_DEPTH=8 -DX265_NS=x265 -D__STDC_LIMIT_MACROS=1 -I/wrkdirs/usr/ports/multimedia/x265/work/x265_3.2.1/source/. -I/wrkdirs/usr/ports/multimedia/x265/work/x265_3.2.1/source/dynamicHDR10 -I. -I/wrkdirs/usr/ports/multimedia/x265/work/x265_3.2.1/source/common -I/wrkdirs/usr/ports/multimedia/x265/work/x265_3.2.1/source/encoder -O2 -pipe -DNDEBUG -O3 -fstack-protector-strong -fno-strict-aliasing -O2 -pipe -DNDEBUG -O3 -fstack-protector-strong -fno-strict-aliasing -Wall -Wextra -Wshadow -std=gnu++11 -fPIC -Wno-array-bounds -ffast-math -mstackrealign -fno-exceptions -MD -MT common/CMakeFiles/common.dir/framedata.cpp.o -MF common/CMakeFiles/common.dir/framedata.cpp.o.d -o common/CMakeFiles/common.dir/framedata.cpp.o -c /wrkdirs/usr/ports/multimedia/x265/work/x265_3.2.1/source/common/framedata.cpp
[11/74] /nxb-bin/usr/bin/c++ -DENABLE_HDR10_PLUS -DEXPORT_C_API=1 -DHAVE_INT_TYPES_H=1 -DHIGH_BIT_DEPTH=0 -DX265_DEPTH=8 -DX265_NS=x265 -D__STDC_LIMIT_MACROS=1 -I/wrkdirs/usr/ports/multimedia/x265/work/x265_3.2.1/source/. -I/wrkdirs/usr/ports/multimedia/x265/work/x265_3.2.1/source/dynamicHDR10 -I. -I/wrkdirs/usr/ports/multimedia/x265/work/x265_3.2.1/source/common -I/wrkdirs/usr/ports/multimedia/x265/work/x265_3.2.1/source/encoder -O2 -pipe -DNDEBUG -O3 -fstack-protector-strong -fno-strict-aliasing -O2 -pipe -DNDEBUG -O3 -fstack-protector-strong -fno-strict-aliasing -Wall -Wextra -Wshadow -std=gnu++11 -fPIC -Wno-array-bounds -ffast-math -mstackrealign -fno-exceptions -MD -MT common/CMakeFiles/common.dir/frame.cpp.o -MF common/CMakeFiles/common.dir/frame.cpp.o.d -o common/CMakeFiles/common.dir/frame.cpp.o -c /wrkdirs/usr/ports/multimedia/x265/work/x265_3.2.1/source/common/frame.cpp
[12/74] /nxb-bin/usr/bin/c++ -DENABLE_HDR10_PLUS -DEXPORT_C_API=1 -DHAVE_INT_TYPES_H=1 -DHIGH_BIT_DEPTH=0 -DX265_DEPTH=8 -DX265_NS=x265 -D__STDC_LIMIT_MACROS=1 -I/wrkdirs/usr/ports/multimedia/x265/work/x265_3.2.1/source/. -I/wrkdirs/usr/ports/multimedia/x265/work/x265_3.2.1/source/dynamicHDR10 -I. -I/wrkdirs/usr/ports/multimedia/x265/work/x265_3.2.1/source/common -I/wrkdirs/usr/ports/multimedia/x265/work/x265_3.2.1/source/encoder -O2 -pipe -DNDEBUG -O3 -fstack-protector-strong -fno-strict-aliasing -O2 -pipe -DNDEBUG -O3 -fstack-protector-strong -fno-strict-aliasing -Wall -Wextra -Wshadow -std=gnu++11 -fPIC -Wno-array-bounds -ffast-math -mstackrealign -fno-exceptions -MD -MT common/CMakeFiles/common.dir/picyuv.cpp.o -MF common/CMakeFiles/common.dir/picyuv.cpp.o.d -o common/CMakeFiles/common.dir/picyuv.cpp.o -c /wrkdirs/usr/ports/multimedia/x265/work/x265_3.2.1/source/common/picyuv.cpp
[13/74] /nxb-bin/usr/bin/c++ -DENABLE_HDR10_PLUS -DEXPORT_C_API=1 -DHAVE_INT_TYPES_H=1 -DHIGH_BIT_DEPTH=0 -DX265_DEPTH=8 -DX265_NS=x265 -D__STDC_LIMIT_MACROS=1 -I/wrkdirs/usr/ports/multimedia/x265/work/x265_3.2.1/source/. -I/wrkdirs/usr/ports/multimedia/x265/work/x265_3.2.1/source/dynamicHDR10 -I. -I/wrkdirs/usr/ports/multimedia/x265/work/x265_3.2.1/source/common -I/wrkdirs/usr/ports/multimedia/x265/work/x265_3.2.1/source/encoder -O2 -pipe -DNDEBUG -O3 -fstack-protector-strong -fno-strict-aliasing -O2 -pipe -DNDEBUG -O3 -fstack-protector-strong -fno-strict-aliasing -Wall -Wextra -Wshadow -std=gnu++11 -fPIC -Wno-array-bounds -ffast-math -mstackrealign -fno-exceptions -MD -MT common/CMakeFiles/common.dir/slice.cpp.o -MF common/CMakeFiles/common.dir/slice.cpp.o.d -o common/CMakeFiles/common.dir/slice.cpp.o -c /wrkdirs/usr/ports/multimedia/x265/work/x265_3.2.1/source/common/slice.cpp
[14/74] /nxb-bin/usr/bin/c++ -DENABLE_HDR10_PLUS -DEXPORT_C_API=1 -DHAVE_INT_TYPES_H=1 -DHIGH_BIT_DEPTH=0 -DX265_DEPTH=8 -DX265_NS=x265 -D__STDC_LIMIT_MACROS=1 -I/wrkdirs/usr/ports/multimedia/x265/work/x265_3.2.1/source/. -I/wrkdirs/usr/ports/multimedia/x265/work/x265_3.2.1/source/dynamicHDR10 -I. -I/wrkdirs/usr/ports/multimedia/x265/work/x265_3.2.1/source/common -I/wrkdirs/usr/ports/multimedia/x265/work/x265_3.2.1/source/encoder -O2 -pipe -DNDEBUG -O3 -fstack-protector-strong -fno-strict-aliasing -O2 -pipe -DNDEBUG -O3 -fstack-protector-strong -fno-strict-aliasing -Wall -Wextra -Wshadow -std=gnu++11 -fPIC -Wno-array-bounds -ffast-math -mstackrealign -fno-exceptions -MD -MT common/CMakeFiles/common.dir/lowres.cpp.o -MF common/CMakeFiles/common.dir/lowres.cpp.o.d -o common/CMakeFiles/common.dir/lowres.cpp.o -c /wrkdirs/usr/ports/multimedia/x265/work/x265_3.2.1/source/common/lowres.cpp
[15/74] /nxb-bin/usr/bin/c++ -DENABLE_HDR10_PLUS -DEXPORT_C_API=1 -DHAVE_INT_TYPES_H=1 -DHIGH_BIT_DEPTH=0 -DX265_DEPTH=8 -DX265_NS=x265 -D__STDC_LIMIT_MACROS=1 -I/wrkdirs/usr/ports/multimedia/x265/work/x265_3.2.1/source/. -I/wrkdirs/usr/ports/multimedia/x265/work/x265_3.2.1/source/dynamicHDR10 -I. -I/wrkdirs/usr/ports/multimedia/x265/work/x265_3.2.1/source/common -I/wrkdirs/usr/ports/multimedia/x265/work/x265_3.2.1/source/encoder -O2 -pipe -DNDEBUG -O3 -fstack-protector-strong -fno-strict-aliasing -O2 -pipe -DNDEBUG -O3 -fstack-protector-strong -fno-strict-aliasing -Wall -Wextra -Wshadow -std=gnu++11 -fPIC -Wno-array-bounds -ffast-math -mstackrealign -fno-exceptions -MD -MT common/CMakeFiles/common.dir/piclist.cpp.o -MF common/CMakeFiles/common.dir/piclist.cpp.o.d -o common/CMakeFiles/common.dir/piclist.cpp.o -c /wrkdirs/usr/ports/multimedia/x265/work/x265_3.2.1/source/common/piclist.cpp
[16/74] /nxb-bin/usr/bin/c++ -DENABLE_HDR10_PLUS -DEXPORT_C_API=1 -DHAVE_INT_TYPES_H=1 -DHIGH_BIT_DEPTH=0 -DX265_DEPTH=8 -DX265_NS=x265 -D__STDC_LIMIT_MACROS=1 -I/wrkdirs/usr/ports/multimedia/x265/work/x265_3.2.1/source/. -I/wrkdirs/usr/ports/multimedia/x265/work/x265_3.2.1/source/dynamicHDR10 -I. -I/wrkdirs/usr/ports/multimedia/x265/work/x265_3.2.1/source/common -I/wrkdirs/usr/ports/multimedia/x265/work/x265_3.2.1/source/encoder -O2 -pipe -DNDEBUG -O3 -fstack-protector-strong -fno-strict-aliasing -O2 -pipe -DNDEBUG -O3 -fstack-protector-strong -fno-strict-aliasing -Wall -Wextra -Wshadow -std=gnu++11 -fPIC -Wno-array-bounds -ffast-math -mstackrealign -fno-exceptions -MD -MT test/CMakeFiles/TestBench.dir/testbench.cpp.o -MF test/CMakeFiles/TestBench.dir/testbench.cpp.o.d -o test/CMakeFiles/TestBench.dir/testbench.cpp.o -c /wrkdirs/usr/ports/multimedia/x265/work/x265_3.2.1/source/test/testbench.cpp
In file included from /wrkdirs/usr/ports/multimedia/x265/work/x265_3.2.1/source/test/testbench.cpp:29:
In file included from /wrkdirs/usr/ports/multimedia/x265/work/x265_3.2.1/source/test/pixelharness.h:28:
/wrkdirs/usr/ports/multimedia/x265/work/x265_3.2.1/source/test/testharness.h:139:9: warning: 'PFX' macro redefined [-Wmacro-redefined]
#define PFX(stack_pagealign)(func, align) func()
^
/wrkdirs/usr/ports/multimedia/x265/work/x265_3.2.1/source/common/cpu.h:32:9: note: previous definition is here
#define PFX(name) PFX2(X265_NS, name)
^
1 warning generated.
[17/74] /nxb-bin/usr/bin/c++ -DENABLE_HDR10_PLUS -DEXPORT_C_API=1 -DHAVE_INT_TYPES_H=1 -DHIGH_BIT_DEPTH=0 -DX265_DEPTH=8 -DX265_NS=x265 -D__STDC_LIMIT_MACROS=1 -I/wrkdirs/usr/ports/multimedia/x265/work/x265_3.2.1/source/. -I/wrkdirs/usr/ports/multimedia/x265/work/x265_3.2.1/source/dynamicHDR10 -I. -I/wrkdirs/usr/ports/multimedia/x265/work/x265_3.2.1/source/common -I/wrkdirs/usr/ports/multimedia/x265/work/x265_3.2.1/source/encoder -O2 -pipe -DNDEBUG -O3 -fstack-protector-strong -fno-strict-aliasing -O2 -pipe -DNDEBUG -O3 -fstack-protector-strong -fno-strict-aliasing -Wall -Wextra -Wshadow -std=gnu++11 -fPIC -Wno-array-bounds -ffast-math -mstackrealign -fno-exceptions -MD -MT common/CMakeFiles/common.dir/scalinglist.cpp.o -MF common/CMakeFiles/common.dir/scalinglist.cpp.o.d -o common/CMakeFiles/common.dir/scalinglist.cpp.o -c /wrkdirs/usr/ports/multimedia/x265/work/x265_3.2.1/source/common/scalinglist.cpp
[18/74] /nxb-bin/usr/bin/c++ -DENABLE_HDR10_PLUS -DEXPORT_C_API=1 -DHAVE_INT_TYPES_H=1 -DHIGH_BIT_DEPTH=0 -DX265_DEPTH=8 -DX265_NS=x265 -D__STDC_LIMIT_MACROS=1 -I/wrkdirs/usr/ports/multimedia/x265/work/x265_3.2.1/source/. -I/wrkdirs/usr/ports/multimedia/x265/work/x265_3.2.1/source/dynamicHDR10 -I. -I/wrkdirs/usr/ports/multimedia/x265/work/x265_3.2.1/source/common -I/wrkdirs/usr/ports/multimedia/x265/work/x265_3.2.1/source/encoder -O2 -pipe -DNDEBUG -O3 -fstack-protector-strong -fno-strict-aliasing -O2 -pipe -DNDEBUG -O3 -fstack-protector-strong -fno-strict-aliasing -Wall -Wextra -Wshadow -std=gnu++11 -fPIC -Wno-array-bounds -ffast-math -mstackrealign -fno-exceptions -MD -MT common/CMakeFiles/common.dir/predict.cpp.o -MF common/CMakeFiles/common.dir/predict.cpp.o.d -o common/CMakeFiles/common.dir/predict.cpp.o -c /wrkdirs/usr/ports/multimedia/x265/work/x265_3.2.1/source/common/predict.cpp
In file included from /wrkdirs/usr/ports/multimedia/x265/work/x265_3.2.1/source/common/predict.cpp:29:
In file included from /wrkdirs/usr/ports/multimedia/x265/work/x265_3.2.1/source/common/predict.h:30:
In file included from /wrkdirs/usr/ports/multimedia/x265/work/x265_3.2.1/source/common/quant.h:29:
/wrkdirs/usr/ports/multimedia/x265/work/x265_3.2.1/source/common/scalinglist.h:36:12: warning: declaration shadows a variable in namespace 'x265' [-Wshadow]
enum { NUM_SIZES = 4 }; // 4x4, 8x8, 16x16, 32x32
^
/wrkdirs/usr/ports/multimedia/x265/work/x265_3.2.1/source/common/cudata.h:51:5: note: previous declaration is here
NUM_SIZES
^
1 warning generated.
[19/74] /nxb-bin/usr/bin/c++ -DENABLE_HDR10_PLUS -DEXPORT_C_API=1 -DHAVE_INT_TYPES_H=1 -DHIGH_BIT_DEPTH=0 -DX265_DEPTH=8 -DX265_NS=x265 -D__STDC_LIMIT_MACROS=1 -I/wrkdirs/usr/ports/multimedia/x265/work/x265_3.2.1/source/. -I/wrkdirs/usr/ports/multimedia/x265/work/x265_3.2.1/source/dynamicHDR10 -I. -I/wrkdirs/usr/ports/multimedia/x265/work/x265_3.2.1/source/common -I/wrkdirs/usr/ports/multimedia/x265/work/x265_3.2.1/source/encoder -O2 -pipe -DNDEBUG -O3 -fstack-protector-strong -fno-strict-aliasing -O2 -pipe -DNDEBUG -O3 -fstack-protector-strong -fno-strict-aliasing -Wall -Wextra -Wshadow -std=gnu++11 -fPIC -Wno-array-bounds -ffast-math -mstackrealign -fno-exceptions -MD -MT common/CMakeFiles/common.dir/deblock.cpp.o -MF common/CMakeFiles/common.dir/deblock.cpp.o.d -o common/CMakeFiles/common.dir/deblock.cpp.o -c /wrkdirs/usr/ports/multimedia/x265/work/x265_3.2.1/source/common/deblock.cpp
[20/74] /nxb-bin/usr/bin/c++ -DENABLE_HDR10_PLUS -DEXPORT_C_API=1 -DHAVE_INT_TYPES_H=1 -DHIGH_BIT_DEPTH=0 -DX265_DEPTH=8 -DX265_NS=x265 -D__STDC_LIMIT_MACROS=1 -I/wrkdirs/usr/ports/multimedia/x265/work/x265_3.2.1/source/. -I/wrkdirs/usr/ports/multimedia/x265/work/x265_3.2.1/source/dynamicHDR10 -I. -I/wrkdirs/usr/ports/multimedia/x265/work/x265_3.2.1/source/common -I/wrkdirs/usr/ports/multimedia/x265/work/x265_3.2.1/source/encoder -O2 -pipe -DNDEBUG -O3 -fstack-protector-strong -fno-strict-aliasing -O2 -pipe -DNDEBUG -O3 -fstack-protector-strong -fno-strict-aliasing -Wall -Wextra -Wshadow -std=gnu++11 -fPIC -Wno-array-bounds -ffast-math -mstackrealign -fno-exceptions -MD -MT common/CMakeFiles/common.dir/cudata.cpp.o -MF common/CMakeFiles/common.dir/cudata.cpp.o.d -o common/CMakeFiles/common.dir/cudata.cpp.o -c /wrkdirs/usr/ports/multimedia/x265/work/x265_3.2.1/source/common/cudata.cpp
[21/74] /nxb-bin/usr/bin/c++ -DENABLE_HDR10_PLUS -DEXPORT_C_API=1 -DHAVE_INT_TYPES_H=1 -DHIGH_BIT_DEPTH=0 -DX265_DEPTH=8 -DX265_NS=x265 -D__STDC_LIMIT_MACROS=1 -I/wrkdirs/usr/ports/multimedia/x265/work/x265_3.2.1/source/. -I/wrkdirs/usr/ports/multimedia/x265/work/x265_3.2.1/source/dynamicHDR10 -I. -I/wrkdirs/usr/ports/multimedia/x265/work/x265_3.2.1/source/common -I/wrkdirs/usr/ports/multimedia/x265/work/x265_3.2.1/source/encoder -O2 -pipe -DNDEBUG -O3 -fstack-protector-strong -fno-strict-aliasing -O2 -pipe -DNDEBUG -O3 -fstack-protector-strong -fno-strict-aliasing -Wall -Wextra -Wshadow -std=gnu++11 -fPIC -Wno-array-bounds -ffast-math -mstackrealign -fno-exceptions -MD -MT test/CMakeFiles/TestBench.dir/pixelharness.cpp.o -MF test/CMakeFiles/TestBench.dir/pixelharness.cpp.o.d -o test/CMakeFiles/TestBench.dir/pixelharness.cpp.o -c /wrkdirs/usr/ports/multimedia/x265/work/x265_3.2.1/source/test/pixelharness.cpp
FAILED: test/CMakeFiles/TestBench.dir/pixelharness.cpp.o
/nxb-bin/usr/bin/c++ -DENABLE_HDR10_PLUS -DEXPORT_C_API=1 -DHAVE_INT_TYPES_H=1 -DHIGH_BIT_DEPTH=0 -DX265_DEPTH=8 -DX265_NS=x265 -D__STDC_LIMIT_MACROS=1 -I/wrkdirs/usr/ports/multimedia/x265/work/x265_3.2.1/source/. -I/wrkdirs/usr/ports/multimedia/x265/work/x265_3.2.1/source/dynamicHDR10 -I. -I/wrkdirs/usr/ports/multimedia/x265/work/x265_3.2.1/source/common -I/wrkdirs/usr/ports/multimedia/x265/work/x265_3.2.1/source/encoder -O2 -pipe -DNDEBUG -O3 -fstack-protector-strong -fno-strict-aliasing -O2 -pipe -DNDEBUG -O3 -fstack-protector-strong -fno-strict-aliasing -Wall -Wextra -Wshadow -std=gnu++11 -fPIC -Wno-array-bounds -ffast-math -mstackrealign -fno-exceptions -MD -MT test/CMakeFiles/TestBench.dir/pixelharness.cpp.o -MF test/CMakeFiles/TestBench.dir/pixelharness.cpp.o.d -o test/CMakeFiles/TestBench.dir/pixelharness.cpp.o -c /wrkdirs/usr/ports/multimedia/x265/work/x265_3.2.1/source/test/pixelharness.cpp
In file included from /wrkdirs/usr/ports/multimedia/x265/work/x265_3.2.1/source/test/pixelharness.cpp:25:
In file included from /wrkdirs/usr/ports/multimedia/x265/work/x265_3.2.1/source/test/pixelharness.h:28:
/wrkdirs/usr/ports/multimedia/x265/work/x265_3.2.1/source/test/testharness.h:139:9: warning: 'PFX' macro redefined [-Wmacro-redefined]
#define PFX(stack_pagealign)(func, align) func()
^
/wrkdirs/usr/ports/multimedia/x265/work/x265_3.2.1/source/common/cpu.h:32:9: note: previous definition is here
#define PFX(name) PFX2(X265_NS, name)
^
In file included from /wrkdirs/usr/ports/multimedia/x265/work/x265_3.2.1/source/test/pixelharness.cpp:27:
In file included from /wrkdirs/usr/ports/multimedia/x265/work/x265_3.2.1/source/encoder/entropy.h:32:
/wrkdirs/usr/ports/multimedia/x265/work/x265_3.2.1/source/common/contexts.h:106:27: error: expected ')'
extern "C" const uint32_t PFX(entropyStateBits)[128];
^
/wrkdirs/usr/ports/multimedia/x265/work/x265_3.2.1/source/test/testharness.h:139:34: note: expanded from macro 'PFX'
#define PFX(stack_pagealign)(func, align) func()
^
/wrkdirs/usr/ports/multimedia/x265/work/x265_3.2.1/source/common/contexts.h:106:27: note: to match this '('
/wrkdirs/usr/ports/multimedia/x265/work/x265_3.2.1/source/test/testharness.h:139:29: note: expanded from macro 'PFX'
#define PFX(stack_pagealign)(func, align) func()
^
In file included from /wrkdirs/usr/ports/multimedia/x265/work/x265_3.2.1/source/test/pixelharness.cpp:27:
In file included from /wrkdirs/usr/ports/multimedia/x265/work/x265_3.2.1/source/encoder/entropy.h:32:
/wrkdirs/usr/ports/multimedia/x265/work/x265_3.2.1/source/common/contexts.h:106:27: error: expected ';' after top level declarator
extern "C" const uint32_t PFX(entropyStateBits)[128];
^
/wrkdirs/usr/ports/multimedia/x265/work/x265_3.2.1/source/test/testharness.h:139:43: note: expanded from macro 'PFX'
#define PFX(stack_pagealign)(func, align) func()
^
/wrkdirs/usr/ports/multimedia/x265/work/x265_3.2.1/source/test/pixelharness.cpp:3181:9: error: use of undeclared identifier '__rdtsc'
REPORT_SPEEDUP(opt.pu[part].satd, ref.pu[part].satd, pbuf1, STRIDE, fref, STRIDE);
^
/wrkdirs/usr/ports/multimedia/x265/work/x265_3.2.1/source/test/testharness.h:104:37: note: expanded from macro 'REPORT_SPEEDUP'
uint32_t t0 = (uint32_t)__rdtsc(); \
^
/wrkdirs/usr/ports/multimedia/x265/work/x265_3.2.1/source/test/pixelharness.cpp:3181:9: error: use of undeclared identifier '__rdtsc'
/wrkdirs/usr/ports/multimedia/x265/work/x265_3.2.1/source/test/testharness.h:109:37: note: expanded from macro 'REPORT_SPEEDUP'
uint32_t t1 = (uint32_t)__rdtsc() - t0; \
^
/wrkdirs/usr/ports/multimedia/x265/work/x265_3.2.1/source/test/pixelharness.cpp:3181:9: error: use of undeclared identifier '__rdtsc'
/wrkdirs/usr/ports/multimedia/x265/work/x265_3.2.1/source/test/testharness.h:115:37: note: expanded from macro 'REPORT_SPEEDUP'
uint32_t t0 = (uint32_t)__rdtsc(); \
^
/wrkdirs/usr/ports/multimedia/x265/work/x265_3.2.1/source/test/pixelharness.cpp:3181:9: error: use of undeclared identifier '__rdtsc'
/wrkdirs/usr/ports/multimedia/x265/work/x265_3.2.1/source/test/testharness.h:120:37: note: expanded from macro 'REPORT_SPEEDUP'
uint32_t t1 = (uint32_t)__rdtsc() - t0; \
^
/wrkdirs/usr/ports/multimedia/x265/work/x265_3.2.1/source/test/pixelharness.cpp:3181:9: error: use of undeclared identifier 'align'; did you mean 'std::align'?
/wrkdirs/usr/ports/multimedia/x265/work/x265_3.2.1/source/test/testharness.h:123:9: note: expanded from macro 'REPORT_SPEEDUP'
x265_emms(); \
^
/wrkdirs/usr/ports/multimedia/x265/work/x265_3.2.1/source/common/cpu.h:46:21: note: expanded from macro 'x265_emms'
#define x265_emms() PFX(cpu_emms)()
^
/wrkdirs/usr/ports/multimedia/x265/work/x265_3.2.1/source/test/testharness.h:139:36: note: expanded from macro 'PFX'
#define PFX(stack_pagealign)(func, align) func()
^
/usr/include/c++/v1/memory:5596:24: note: 'std::align' declared here
_LIBCPP_FUNC_VIS void* align(size_t __align, size_t __sz, void*& __ptr, size_t& __space);
^
/wrkdirs/usr/ports/multimedia/x265/work/x265_3.2.1/source/test/pixelharness.cpp:3181:9: error: expected ';' after expression
REPORT_SPEEDUP(opt.pu[part].satd, ref.pu[part].satd, pbuf1, STRIDE, fref, STRIDE);
^
/wrkdirs/usr/ports/multimedia/x265/work/x265_3.2.1/source/test/testharness.h:123:9: note: expanded from macro 'REPORT_SPEEDUP'
x265_emms(); \
^
/wrkdirs/usr/ports/multimedia/x265/work/x265_3.2.1/source/common/cpu.h:46:21: note: expanded from macro 'x265_emms'
#define x265_emms() PFX(cpu_emms)()
^
/wrkdirs/usr/ports/multimedia/x265/work/x265_3.2.1/source/test/testharness.h:139:43: note: expanded from macro 'PFX'
#define PFX(stack_pagealign)(func, align) func()
^
/wrkdirs/usr/ports/multimedia/x265/work/x265_3.2.1/source/test/pixelharness.cpp:3181:9: error: called object type 'uint32_t' (aka 'unsigned int') is not a function or function pointer
REPORT_SPEEDUP(opt.pu[part].satd, ref.pu[part].satd, pbuf1, STRIDE, fref, STRIDE);
^~~~~~~~~~~~~~~~~~~~~~~~~~~~~~~~~~~~~~~~~~~~~~~~~~~~~~~~~~~~~~~~~~~~~~~~~~~~~~~~~
/wrkdirs/usr/ports/multimedia/x265/work/x265_3.2.1/source/test/testharness.h:123:9: note: expanded from macro 'REPORT_SPEEDUP'
x265_emms(); \
^~~~~~~~~~~
/wrkdirs/usr/ports/multimedia/x265/work/x265_3.2.1/source/common/cpu.h:46:21: note: expanded from macro 'x265_emms'
#define x265_emms() PFX(cpu_emms)()
^~~~~~~~~~~~~
/wrkdirs/usr/ports/multimedia/x265/work/x265_3.2.1/source/test/testharness.h:139:47: note: expanded from macro 'PFX'
#define PFX(stack_pagealign)(func, align) func()
~~~~^
/wrkdirs/usr/ports/multimedia/x265/work/x265_3.2.1/source/test/pixelharness.cpp:3186:9: error: use of undeclared identifier '__rdtsc'
REPORT_SPEEDUP(opt.pu[part].pixelavg_pp[NONALIGNED], ref.pu[part].pixelavg_pp[NONALIGNED], pbuf1, STRIDE, pbuf2, STRIDE, pbuf3, STRIDE, 32);
^
/wrkdirs/usr/ports/multimedia/x265/work/x265_3.2.1/source/test/testharness.h:104:37: note: expanded from macro 'REPORT_SPEEDUP'
uint32_t t0 = (uint32_t)__rdtsc(); \
^
/wrkdirs/usr/ports/multimedia/x265/work/x265_3.2.1/source/test/pixelharness.cpp:3186:9: error: use of undeclared identifier '__rdtsc'
/wrkdirs/usr/ports/multimedia/x265/work/x265_3.2.1/source/test/testharness.h:109:37: note: expanded from macro 'REPORT_SPEEDUP'
uint32_t t1 = (uint32_t)__rdtsc() - t0; \
^
/wrkdirs/usr/ports/multimedia/x265/work/x265_3.2.1/source/test/pixelharness.cpp:3186:9: error: use of undeclared identifier '__rdtsc'
/wrkdirs/usr/ports/multimedia/x265/work/x265_3.2.1/source/test/testharness.h:115:37: note: expanded from macro 'REPORT_SPEEDUP'
uint32_t t0 = (uint32_t)__rdtsc(); \
^
/wrkdirs/usr/ports/multimedia/x265/work/x265_3.2.1/source/test/pixelharness.cpp:3186:9: error: use of undeclared identifier '__rdtsc'
/wrkdirs/usr/ports/multimedia/x265/work/x265_3.2.1/source/test/testharness.h:120:37: note: expanded from macro 'REPORT_SPEEDUP'
uint32_t t1 = (uint32_t)__rdtsc() - t0; \
^
/wrkdirs/usr/ports/multimedia/x265/work/x265_3.2.1/source/test/pixelharness.cpp:3186:9: error: use of undeclared identifier 'align'; did you mean 'std::align'?
/wrkdirs/usr/ports/multimedia/x265/work/x265_3.2.1/source/test/testharness.h:123:9: note: expanded from macro 'REPORT_SPEEDUP'
x265_emms(); \
^
/wrkdirs/usr/ports/multimedia/x265/work/x265_3.2.1/source/common/cpu.h:46:21: note: expanded from macro 'x265_emms'
#define x265_emms() PFX(cpu_emms)()
^
/wrkdirs/usr/ports/multimedia/x265/work/x265_3.2.1/source/test/testharness.h:139:36: note: expanded from macro 'PFX'
#define PFX(stack_pagealign)(func, align) func()
^
/usr/include/c++/v1/memory:5596:24: note: 'std::align' declared here
_LIBCPP_FUNC_VIS void* align(size_t __align, size_t __sz, void*& __ptr, size_t& __space);
^
/wrkdirs/usr/ports/multimedia/x265/work/x265_3.2.1/source/test/pixelharness.cpp:3186:9: error: expected ';' after expression
REPORT_SPEEDUP(opt.pu[part].pixelavg_pp[NONALIGNED], ref.pu[part].pixelavg_pp[NONALIGNED], pbuf1, STRIDE, pbuf2, STRIDE, pbuf3, STRIDE, 32);
^
/wrkdirs/usr/ports/multimedia/x265/work/x265_3.2.1/source/test/testharness.h:123:9: note: expanded from macro 'REPORT_SPEEDUP'
x265_emms(); \
^
/wrkdirs/usr/ports/multimedia/x265/work/x265_3.2.1/source/common/cpu.h:46:21: note: expanded from macro 'x265_emms'
#define x265_emms() PFX(cpu_emms)()
^
/wrkdirs/usr/ports/multimedia/x265/work/x265_3.2.1/source/test/testharness.h:139:43: note: expanded from macro 'PFX'
#define PFX(stack_pagealign)(func, align) func()
^
/wrkdirs/usr/ports/multimedia/x265/work/x265_3.2.1/source/test/pixelharness.cpp:3186:9: error: called object type 'uint32_t' (aka 'unsigned int') is not a function or function pointer
REPORT_SPEEDUP(opt.pu[part].pixelavg_pp[NONALIGNED], ref.pu[part].pixelavg_pp[NONALIGNED], pbuf1, STRIDE, pbuf2, STRIDE, pbuf3, STRIDE, 32);
^~~~~~~~~~~~~~~~~~~~~~~~~~~~~~~~~~~~~~~~~~~~~~~~~~~~~~~~~~~~~~~~~~~~~~~~~~~~~~~~~~~~~~~~~~~~~~~~~~~~~~~~~~~~~~~~~~~~~~~~~~~~~~~~~~~~~~~~~~~
/wrkdirs/usr/ports/multimedia/x265/work/x265_3.2.1/source/test/testharness.h:123:9: note: expanded from macro 'REPORT_SPEEDUP'
x265_emms(); \
^~~~~~~~~~~
/wrkdirs/usr/ports/multimedia/x265/work/x265_3.2.1/source/common/cpu.h:46:21: note: expanded from macro 'x265_emms'
#define x265_emms() PFX(cpu_emms)()
^~~~~~~~~~~~~
/wrkdirs/usr/ports/multimedia/x265/work/x265_3.2.1/source/test/testharness.h:139:47: note: expanded from macro 'PFX'
#define PFX(stack_pagealign)(func, align) func()
~~~~^
/wrkdirs/usr/ports/multimedia/x265/work/x265_3.2.1/source/test/pixelharness.cpp:3192:9: error: use of undeclared identifier '__rdtsc'
REPORT_SPEEDUP(opt.pu[part].pixelavg_pp[ALIGNED], ref.pu[part].pixelavg_pp[ALIGNED], pbuf1, STRIDE, pbuf2, STRIDE, pbuf3, STRIDE, 32);
^
/wrkdirs/usr/ports/multimedia/x265/work/x265_3.2.1/source/test/testharness.h:104:37: note: expanded from macro 'REPORT_SPEEDUP'
uint32_t t0 = (uint32_t)__rdtsc(); \
^
/wrkdirs/usr/ports/multimedia/x265/work/x265_3.2.1/source/test/pixelharness.cpp:3192:9: error: use of undeclared identifier '__rdtsc'
/wrkdirs/usr/ports/multimedia/x265/work/x265_3.2.1/source/test/testharness.h:109:37: note: expanded from macro 'REPORT_SPEEDUP'
uint32_t t1 = (uint32_t)__rdtsc() - t0; \
^
/wrkdirs/usr/ports/multimedia/x265/work/x265_3.2.1/source/test/pixelharness.cpp:3192:9: error: use of undeclared identifier '__rdtsc'
/wrkdirs/usr/ports/multimedia/x265/work/x265_3.2.1/source/test/testharness.h:115:37: note: expanded from macro 'REPORT_SPEEDUP'
uint32_t t0 = (uint32_t)__rdtsc(); \
^
fatal error: too many errors emitted, stopping now [-ferror-limit=]
1 warning and 20 errors generated.
[22/74] /nxb-bin/usr/bin/c++ -DENABLE_HDR10_PLUS -DEXPORT_C_API=1 -DHAVE_INT_TYPES_H=1 -DHIGH_BIT_DEPTH=0 -DX265_DEPTH=8 -DX265_NS=x265 -D__STDC_LIMIT_MACROS=1 -I/wrkdirs/usr/ports/multimedia/x265/work/x265_3.2.1/source/. -I/wrkdirs/usr/ports/multimedia/x265/work/x265_3.2.1/source/dynamicHDR10 -I. -I/wrkdirs/usr/ports/multimedia/x265/work/x265_3.2.1/source/common -I/wrkdirs/usr/ports/multimedia/x265/work/x265_3.2.1/source/encoder -O2 -pipe -DNDEBUG -O3 -fstack-protector-strong -fno-strict-aliasing -O2 -pipe -DNDEBUG -O3 -fstack-protector-strong -fno-strict-aliasing -Wall -Wextra -Wshadow -std=gnu++11 -fPIC -Wno-array-bounds -ffast-math -mstackrealign -fno-exceptions -MD -MT test/CMakeFiles/TestBench.dir/mbdstharness.cpp.o -MF test/CMakeFiles/TestBench.dir/mbdstharness.cpp.o.d -o test/CMakeFiles/TestBench.dir/mbdstharness.cpp.o -c /wrkdirs/usr/ports/multimedia/x265/work/x265_3.2.1/source/test/mbdstharness.cpp
FAILED: test/CMakeFiles/TestBench.dir/mbdstharness.cpp.o
/nxb-bin/usr/bin/c++ -DENABLE_HDR10_PLUS -DEXPORT_C_API=1 -DHAVE_INT_TYPES_H=1 -DHIGH_BIT_DEPTH=0 -DX265_DEPTH=8 -DX265_NS=x265 -D__STDC_LIMIT_MACROS=1 -I/wrkdirs/usr/ports/multimedia/x265/work/x265_3.2.1/source/. -I/wrkdirs/usr/ports/multimedia/x265/work/x265_3.2.1/source/dynamicHDR10 -I. -I/wrkdirs/usr/ports/multimedia/x265/work/x265_3.2.1/source/common -I/wrkdirs/usr/ports/multimedia/x265/work/x265_3.2.1/source/encoder -O2 -pipe -DNDEBUG -O3 -fstack-protector-strong -fno-strict-aliasing -O2 -pipe -DNDEBUG -O3 -fstack-protector-strong -fno-strict-aliasing -Wall -Wextra -Wshadow -std=gnu++11 -fPIC -Wno-array-bounds -ffast-math -mstackrealign -fno-exceptions -MD -MT test/CMakeFiles/TestBench.dir/mbdstharness.cpp.o -MF test/CMakeFiles/TestBench.dir/mbdstharness.cpp.o.d -o test/CMakeFiles/TestBench.dir/mbdstharness.cpp.o -c /wrkdirs/usr/ports/multimedia/x265/work/x265_3.2.1/source/test/mbdstharness.cpp
In file included from /wrkdirs/usr/ports/multimedia/x265/work/x265_3.2.1/source/test/mbdstharness.cpp:28:
In file included from /wrkdirs/usr/ports/multimedia/x265/work/x265_3.2.1/source/test/mbdstharness.h:30:
/wrkdirs/usr/ports/multimedia/x265/work/x265_3.2.1/source/test/testharness.h:139:9: warning: 'PFX' macro redefined [-Wmacro-redefined]
#define PFX(stack_pagealign)(func, align) func()
^
/wrkdirs/usr/ports/multimedia/x265/work/x265_3.2.1/source/common/cpu.h:32:9: note: previous definition is here
#define PFX(name) PFX2(X265_NS, name)
^
/wrkdirs/usr/ports/multimedia/x265/work/x265_3.2.1/source/test/mbdstharness.cpp:623:9: error: use of undeclared identifier '__rdtsc'
REPORT_SPEEDUP(opt.dst4x4, ref.dst4x4, mbuf1, mshortbuf2, 4);
^
/wrkdirs/usr/ports/multimedia/x265/work/x265_3.2.1/source/test/testharness.h:104:37: note: expanded from macro 'REPORT_SPEEDUP'
uint32_t t0 = (uint32_t)__rdtsc(); \
^
/wrkdirs/usr/ports/multimedia/x265/work/x265_3.2.1/source/test/mbdstharness.cpp:623:9: error: use of undeclared identifier '__rdtsc'
/wrkdirs/usr/ports/multimedia/x265/work/x265_3.2.1/source/test/testharness.h:109:37: note: expanded from macro 'REPORT_SPEEDUP'
uint32_t t1 = (uint32_t)__rdtsc() - t0; \
^
/wrkdirs/usr/ports/multimedia/x265/work/x265_3.2.1/source/test/mbdstharness.cpp:623:9: error: use of undeclared identifier '__rdtsc'
/wrkdirs/usr/ports/multimedia/x265/work/x265_3.2.1/source/test/testharness.h:115:37: note: expanded from macro 'REPORT_SPEEDUP'
uint32_t t0 = (uint32_t)__rdtsc(); \
^
/wrkdirs/usr/ports/multimedia/x265/work/x265_3.2.1/source/test/mbdstharness.cpp:623:9: error: use of undeclared identifier '__rdtsc'
/wrkdirs/usr/ports/multimedia/x265/work/x265_3.2.1/source/test/testharness.h:120:37: note: expanded from macro 'REPORT_SPEEDUP'
uint32_t t1 = (uint32_t)__rdtsc() - t0; \
^
/wrkdirs/usr/ports/multimedia/x265/work/x265_3.2.1/source/test/mbdstharness.cpp:623:9: error: use of undeclared identifier 'func'
/wrkdirs/usr/ports/multimedia/x265/work/x265_3.2.1/source/test/testharness.h:123:9: note: expanded from macro 'REPORT_SPEEDUP'
x265_emms(); \
^
/wrkdirs/usr/ports/multimedia/x265/work/x265_3.2.1/source/common/cpu.h:46:21: note: expanded from macro 'x265_emms'
#define x265_emms() PFX(cpu_emms)()
^
/wrkdirs/usr/ports/multimedia/x265/work/x265_3.2.1/source/test/testharness.h:139:30: note: expanded from macro 'PFX'
#define PFX(stack_pagealign)(func, align) func()
^
/wrkdirs/usr/ports/multimedia/x265/work/x265_3.2.1/source/test/mbdstharness.cpp:623:9: error: use of undeclared identifier 'align'; did you mean 'std::align'?
/wrkdirs/usr/ports/multimedia/x265/work/x265_3.2.1/source/test/testharness.h:123:9: note: expanded from macro 'REPORT_SPEEDUP'
x265_emms(); \
^
/wrkdirs/usr/ports/multimedia/x265/work/x265_3.2.1/source/common/cpu.h:46:21: note: expanded from macro 'x265_emms'
#define x265_emms() PFX(cpu_emms)()
^
/wrkdirs/usr/ports/multimedia/x265/work/x265_3.2.1/source/test/testharness.h:139:36: note: expanded from macro 'PFX'
#define PFX(stack_pagealign)(func, align) func()
^
/usr/include/c++/v1/memory:5596:24: note: 'std::align' declared here
_LIBCPP_FUNC_VIS void* align(size_t __align, size_t __sz, void*& __ptr, size_t& __space);
^
/wrkdirs/usr/ports/multimedia/x265/work/x265_3.2.1/source/test/mbdstharness.cpp:631:13: error: use of undeclared identifier '__rdtsc'
REPORT_SPEEDUP(opt.cu[value].dct, ref.cu[value].dct, mbuf1, mshortbuf2, dctInfo[value].width);
^
/wrkdirs/usr/ports/multimedia/x265/work/x265_3.2.1/source/test/testharness.h:104:37: note: expanded from macro 'REPORT_SPEEDUP'
uint32_t t0 = (uint32_t)__rdtsc(); \
^
/wrkdirs/usr/ports/multimedia/x265/work/x265_3.2.1/source/test/mbdstharness.cpp:631:13: error: use of undeclared identifier '__rdtsc'
/wrkdirs/usr/ports/multimedia/x265/work/x265_3.2.1/source/test/testharness.h:109:37: note: expanded from macro 'REPORT_SPEEDUP'
uint32_t t1 = (uint32_t)__rdtsc() - t0; \
^
/wrkdirs/usr/ports/multimedia/x265/work/x265_3.2.1/source/test/mbdstharness.cpp:631:13: error: use of undeclared identifier '__rdtsc'
/wrkdirs/usr/ports/multimedia/x265/work/x265_3.2.1/source/test/testharness.h:115:37: note: expanded from macro 'REPORT_SPEEDUP'
uint32_t t0 = (uint32_t)__rdtsc(); \
^
/wrkdirs/usr/ports/multimedia/x265/work/x265_3.2.1/source/test/mbdstharness.cpp:631:13: error: use of undeclared identifier '__rdtsc'
/wrkdirs/usr/ports/multimedia/x265/work/x265_3.2.1/source/test/testharness.h:120:37: note: expanded from macro 'REPORT_SPEEDUP'
uint32_t t1 = (uint32_t)__rdtsc() - t0; \
^
/wrkdirs/usr/ports/multimedia/x265/work/x265_3.2.1/source/test/mbdstharness.cpp:631:13: error: use of undeclared identifier 'func'
/wrkdirs/usr/ports/multimedia/x265/work/x265_3.2.1/source/test/testharness.h:123:9: note: expanded from macro 'REPORT_SPEEDUP'
x265_emms(); \
^
/wrkdirs/usr/ports/multimedia/x265/work/x265_3.2.1/source/common/cpu.h:46:21: note: expanded from macro 'x265_emms'
#define x265_emms() PFX(cpu_emms)()
^
/wrkdirs/usr/ports/multimedia/x265/work/x265_3.2.1/source/test/testharness.h:139:30: note: expanded from macro 'PFX'
#define PFX(stack_pagealign)(func, align) func()
^
/wrkdirs/usr/ports/multimedia/x265/work/x265_3.2.1/source/test/mbdstharness.cpp:631:13: error: use of undeclared identifier 'align'; did you mean 'std::align'?
/wrkdirs/usr/ports/multimedia/x265/work/x265_3.2.1/source/test/testharness.h:123:9: note: expanded from macro 'REPORT_SPEEDUP'
x265_emms(); \
^
/wrkdirs/usr/ports/multimedia/x265/work/x265_3.2.1/source/common/cpu.h:46:21: note: expanded from macro 'x265_emms'
#define x265_emms() PFX(cpu_emms)()
^
/wrkdirs/usr/ports/multimedia/x265/work/x265_3.2.1/source/test/testharness.h:139:36: note: expanded from macro 'PFX'
#define PFX(stack_pagealign)(func, align) func()
^
/usr/include/c++/v1/memory:5596:24: note: 'std::align' declared here
_LIBCPP_FUNC_VIS void* align(size_t __align, size_t __sz, void*& __ptr, size_t& __space);
^
/wrkdirs/usr/ports/multimedia/x265/work/x265_3.2.1/source/test/mbdstharness.cpp:638:9: error: use of undeclared identifier '__rdtsc'
REPORT_SPEEDUP(opt.idst4x4, ref.idst4x4, mbuf1, mshortbuf2, 4);
^
/wrkdirs/usr/ports/multimedia/x265/work/x265_3.2.1/source/test/testharness.h:104:37: note: expanded from macro 'REPORT_SPEEDUP'
uint32_t t0 = (uint32_t)__rdtsc(); \
^
/wrkdirs/usr/ports/multimedia/x265/work/x265_3.2.1/source/test/mbdstharness.cpp:638:9: error: use of undeclared identifier '__rdtsc'
/wrkdirs/usr/ports/multimedia/x265/work/x265_3.2.1/source/test/testharness.h:109:37: note: expanded from macro 'REPORT_SPEEDUP'
uint32_t t1 = (uint32_t)__rdtsc() - t0; \
^
/wrkdirs/usr/ports/multimedia/x265/work/x265_3.2.1/source/test/mbdstharness.cpp:638:9: error: use of undeclared identifier '__rdtsc'
/wrkdirs/usr/ports/multimedia/x265/work/x265_3.2.1/source/test/testharness.h:115:37: note: expanded from macro 'REPORT_SPEEDUP'
uint32_t t0 = (uint32_t)__rdtsc(); \
^
/wrkdirs/usr/ports/multimedia/x265/work/x265_3.2.1/source/test/mbdstharness.cpp:638:9: error: use of undeclared identifier '__rdtsc'
/wrkdirs/usr/ports/multimedia/x265/work/x265_3.2.1/source/test/testharness.h:120:37: note: expanded from macro 'REPORT_SPEEDUP'
uint32_t t1 = (uint32_t)__rdtsc() - t0; \
^
/wrkdirs/usr/ports/multimedia/x265/work/x265_3.2.1/source/test/mbdstharness.cpp:638:9: error: use of undeclared identifier 'func'
/wrkdirs/usr/ports/multimedia/x265/work/x265_3.2.1/source/test/testharness.h:123:9: note: expanded from macro 'REPORT_SPEEDUP'
x265_emms(); \
^
/wrkdirs/usr/ports/multimedia/x265/work/x265_3.2.1/source/common/cpu.h:46:21: note: expanded from macro 'x265_emms'
#define x265_emms() PFX(cpu_emms)()
^
/wrkdirs/usr/ports/multimedia/x265/work/x265_3.2.1/source/test/testharness.h:139:30: note: expanded from macro 'PFX'
#define PFX(stack_pagealign)(func, align) func()
^
/wrkdirs/usr/ports/multimedia/x265/work/x265_3.2.1/source/test/mbdstharness.cpp:638:9: error: use of undeclared identifier 'align'; did you mean 'std::align'?
/wrkdirs/usr/ports/multimedia/x265/work/x265_3.2.1/source/test/testharness.h:123:9: note: expanded from macro 'REPORT_SPEEDUP'
x265_emms(); \
^
/wrkdirs/usr/ports/multimedia/x265/work/x265_3.2.1/source/common/cpu.h:46:21: note: expanded from macro 'x265_emms'
#define x265_emms() PFX(cpu_emms)()
^
/wrkdirs/usr/ports/multimedia/x265/work/x265_3.2.1/source/test/testharness.h:139:36: note: expanded from macro 'PFX'
#define PFX(stack_pagealign)(func, align) func()
^
/usr/include/c++/v1/memory:5596:24: note: 'std::align' declared here
_LIBCPP_FUNC_VIS void* align(size_t __align, size_t __sz, void*& __ptr, size_t& __space);
^
/wrkdirs/usr/ports/multimedia/x265/work/x265_3.2.1/source/test/mbdstharness.cpp:646:13: error: use of undeclared identifier '__rdtsc'
REPORT_SPEEDUP(opt.cu[value].idct, ref.cu[value].idct, mshortbuf3, mshortbuf2, idctInfo[value].width);
^
/wrkdirs/usr/ports/multimedia/x265/work/x265_3.2.1/source/test/testharness.h:104:37: note: expanded from macro 'REPORT_SPEEDUP'
uint32_t t0 = (uint32_t)__rdtsc(); \
^
fatal error: too many errors emitted, stopping now [-ferror-limit=]
1 warning and 20 errors generated.
[23/74] /nxb-bin/usr/bin/c++ -DENABLE_HDR10_PLUS -DEXPORT_C_API=1 -DHAVE_INT_TYPES_H=1 -DHIGH_BIT_DEPTH=0 -DX265_DEPTH=8 -DX265_NS=x265 -D__STDC_LIMIT_MACROS=1 -I/wrkdirs/usr/ports/multimedia/x265/work/x265_3.2.1/source/. -I/wrkdirs/usr/ports/multimedia/x265/work/x265_3.2.1/source/dynamicHDR10 -I. -I/wrkdirs/usr/ports/multimedia/x265/work/x265_3.2.1/source/common -I/wrkdirs/usr/ports/multimedia/x265/work/x265_3.2.1/source/encoder -O2 -pipe -DNDEBUG -O3 -fstack-protector-strong -fno-strict-aliasing -O2 -pipe -DNDEBUG -O3 -fstack-protector-strong -fno-strict-aliasing -Wall -Wextra -Wshadow -std=gnu++11 -fPIC -Wno-array-bounds -ffast-math -mstackrealign -fno-exceptions -DHAVE_STRTOK_R=1 -MD -MT common/CMakeFiles/common.dir/param.cpp.o -MF common/CMakeFiles/common.dir/param.cpp.o.d -o common/CMakeFiles/common.dir/param.cpp.o -c /wrkdirs/usr/ports/multimedia/x265/work/x265_3.2.1/source/common/param.cpp
[24/74] /nxb-bin/usr/bin/c++ -DENABLE_HDR10_PLUS -DEXPORT_C_API=1 -DHAVE_INT_TYPES_H=1 -DHIGH_BIT_DEPTH=0 -DX265_DEPTH=8 -DX265_NS=x265 -D__STDC_LIMIT_MACROS=1 -I/wrkdirs/usr/ports/multimedia/x265/work/x265_3.2.1/source/. -I/wrkdirs/usr/ports/multimedia/x265/work/x265_3.2.1/source/dynamicHDR10 -I. -I/wrkdirs/usr/ports/multimedia/x265/work/x265_3.2.1/source/common -I/wrkdirs/usr/ports/multimedia/x265/work/x265_3.2.1/source/encoder -O2 -pipe -DNDEBUG -O3 -fstack-protector-strong -fno-strict-aliasing -O2 -pipe -DNDEBUG -O3 -fstack-protector-strong -fno-strict-aliasing -Wall -Wextra -Wshadow -std=gnu++11 -fPIC -Wno-array-bounds -ffast-math -mstackrealign -fno-exceptions -MD -MT test/CMakeFiles/TestBench.dir/ipfilterharness.cpp.o -MF test/CMakeFiles/TestBench.dir/ipfilterharness.cpp.o.d -o test/CMakeFiles/TestBench.dir/ipfilterharness.cpp.o -c /wrkdirs/usr/ports/multimedia/x265/work/x265_3.2.1/source/test/ipfilterharness.cpp
FAILED: test/CMakeFiles/TestBench.dir/ipfilterharness.cpp.o
/nxb-bin/usr/bin/c++ -DENABLE_HDR10_PLUS -DEXPORT_C_API=1 -DHAVE_INT_TYPES_H=1 -DHIGH_BIT_DEPTH=0 -DX265_DEPTH=8 -DX265_NS=x265 -D__STDC_LIMIT_MACROS=1 -I/wrkdirs/usr/ports/multimedia/x265/work/x265_3.2.1/source/. -I/wrkdirs/usr/ports/multimedia/x265/work/x265_3.2.1/source/dynamicHDR10 -I. -I/wrkdirs/usr/ports/multimedia/x265/work/x265_3.2.1/source/common -I/wrkdirs/usr/ports/multimedia/x265/work/x265_3.2.1/source/encoder -O2 -pipe -DNDEBUG -O3 -fstack-protector-strong -fno-strict-aliasing -O2 -pipe -DNDEBUG -O3 -fstack-protector-strong -fno-strict-aliasing -Wall -Wextra -Wshadow -std=gnu++11 -fPIC -Wno-array-bounds -ffast-math -mstackrealign -fno-exceptions -MD -MT test/CMakeFiles/TestBench.dir/ipfilterharness.cpp.o -MF test/CMakeFiles/TestBench.dir/ipfilterharness.cpp.o.d -o test/CMakeFiles/TestBench.dir/ipfilterharness.cpp.o -c /wrkdirs/usr/ports/multimedia/x265/work/x265_3.2.1/source/test/ipfilterharness.cpp
In file included from /wrkdirs/usr/ports/multimedia/x265/work/x265_3.2.1/source/test/ipfilterharness.cpp:28:
In file included from /wrkdirs/usr/ports/multimedia/x265/work/x265_3.2.1/source/test/ipfilterharness.h:30:
/wrkdirs/usr/ports/multimedia/x265/work/x265_3.2.1/source/test/testharness.h:139:9: warning: 'PFX' macro redefined [-Wmacro-redefined]
#define PFX(stack_pagealign)(func, align) func()
^
/wrkdirs/usr/ports/multimedia/x265/work/x265_3.2.1/source/common/cpu.h:32:9: note: previous definition is here
#define PFX(name) PFX2(X265_NS, name)
^
/wrkdirs/usr/ports/multimedia/x265/work/x265_3.2.1/source/test/ipfilterharness.cpp:720:13: error: use of undeclared identifier '__rdtsc'
REPORT_SPEEDUP(opt.pu[value].luma_hpp, ref.pu[value].luma_hpp,
^
/wrkdirs/usr/ports/multimedia/x265/work/x265_3.2.1/source/test/testharness.h:104:37: note: expanded from macro 'REPORT_SPEEDUP'
uint32_t t0 = (uint32_t)__rdtsc(); \
^
/wrkdirs/usr/ports/multimedia/x265/work/x265_3.2.1/source/test/ipfilterharness.cpp:720:13: error: use of undeclared identifier '__rdtsc'
/wrkdirs/usr/ports/multimedia/x265/work/x265_3.2.1/source/test/testharness.h:109:37: note: expanded from macro 'REPORT_SPEEDUP'
uint32_t t1 = (uint32_t)__rdtsc() - t0; \
^
/wrkdirs/usr/ports/multimedia/x265/work/x265_3.2.1/source/test/ipfilterharness.cpp:720:13: error: use of undeclared identifier '__rdtsc'
/wrkdirs/usr/ports/multimedia/x265/work/x265_3.2.1/source/test/testharness.h:115:37: note: expanded from macro 'REPORT_SPEEDUP'
uint32_t t0 = (uint32_t)__rdtsc(); \
^
/wrkdirs/usr/ports/multimedia/x265/work/x265_3.2.1/source/test/ipfilterharness.cpp:720:13: error: use of undeclared identifier '__rdtsc'
/wrkdirs/usr/ports/multimedia/x265/work/x265_3.2.1/source/test/testharness.h:120:37: note: expanded from macro 'REPORT_SPEEDUP'
uint32_t t1 = (uint32_t)__rdtsc() - t0; \
^
/wrkdirs/usr/ports/multimedia/x265/work/x265_3.2.1/source/test/ipfilterharness.cpp:720:13: error: use of undeclared identifier 'func'
/wrkdirs/usr/ports/multimedia/x265/work/x265_3.2.1/source/test/testharness.h:123:9: note: expanded from macro 'REPORT_SPEEDUP'
x265_emms(); \
^
/wrkdirs/usr/ports/multimedia/x265/work/x265_3.2.1/source/common/cpu.h:46:21: note: expanded from macro 'x265_emms'
#define x265_emms() PFX(cpu_emms)()
^
/wrkdirs/usr/ports/multimedia/x265/work/x265_3.2.1/source/test/testharness.h:139:30: note: expanded from macro 'PFX'
#define PFX(stack_pagealign)(func, align) func()
^
/wrkdirs/usr/ports/multimedia/x265/work/x265_3.2.1/source/test/ipfilterharness.cpp:720:13: error: use of undeclared identifier 'align'; did you mean 'std::align'?
/wrkdirs/usr/ports/multimedia/x265/work/x265_3.2.1/source/test/testharness.h:123:9: note: expanded from macro 'REPORT_SPEEDUP'
x265_emms(); \
^
/wrkdirs/usr/ports/multimedia/x265/work/x265_3.2.1/source/common/cpu.h:46:21: note: expanded from macro 'x265_emms'
#define x265_emms() PFX(cpu_emms)()
^
/wrkdirs/usr/ports/multimedia/x265/work/x265_3.2.1/source/test/testharness.h:139:36: note: expanded from macro 'PFX'
#define PFX(stack_pagealign)(func, align) func()
^
/usr/include/c++/v1/memory:5596:24: note: 'std::align' declared here
_LIBCPP_FUNC_VIS void* align(size_t __align, size_t __sz, void*& __ptr, size_t& __space);
^
/wrkdirs/usr/ports/multimedia/x265/work/x265_3.2.1/source/test/ipfilterharness.cpp:727:13: error: use of undeclared identifier '__rdtsc'
REPORT_SPEEDUP(opt.pu[value].luma_hps, ref.pu[value].luma_hps,
^
/wrkdirs/usr/ports/multimedia/x265/work/x265_3.2.1/source/test/testharness.h:104:37: note: expanded from macro 'REPORT_SPEEDUP'
uint32_t t0 = (uint32_t)__rdtsc(); \
^
/wrkdirs/usr/ports/multimedia/x265/work/x265_3.2.1/source/test/ipfilterharness.cpp:727:13: error: use of undeclared identifier '__rdtsc'
/wrkdirs/usr/ports/multimedia/x265/work/x265_3.2.1/source/test/testharness.h:109:37: note: expanded from macro 'REPORT_SPEEDUP'
uint32_t t1 = (uint32_t)__rdtsc() - t0; \
^
/wrkdirs/usr/ports/multimedia/x265/work/x265_3.2.1/source/test/ipfilterharness.cpp:727:13: error: use of undeclared identifier '__rdtsc'
/wrkdirs/usr/ports/multimedia/x265/work/x265_3.2.1/source/test/testharness.h:115:37: note: expanded from macro 'REPORT_SPEEDUP'
uint32_t t0 = (uint32_t)__rdtsc(); \
^
/wrkdirs/usr/ports/multimedia/x265/work/x265_3.2.1/source/test/ipfilterharness.cpp:727:13: error: use of undeclared identifier '__rdtsc'
/wrkdirs/usr/ports/multimedia/x265/work/x265_3.2.1/source/test/testharness.h:120:37: note: expanded from macro 'REPORT_SPEEDUP'
uint32_t t1 = (uint32_t)__rdtsc() - t0; \
^
/wrkdirs/usr/ports/multimedia/x265/work/x265_3.2.1/source/test/ipfilterharness.cpp:727:13: error: use of undeclared identifier 'func'
/wrkdirs/usr/ports/multimedia/x265/work/x265_3.2.1/source/test/testharness.h:123:9: note: expanded from macro 'REPORT_SPEEDUP'
x265_emms(); \
^
/wrkdirs/usr/ports/multimedia/x265/work/x265_3.2.1/source/common/cpu.h:46:21: note: expanded from macro 'x265_emms'
#define x265_emms() PFX(cpu_emms)()
^
/wrkdirs/usr/ports/multimedia/x265/work/x265_3.2.1/source/test/testharness.h:139:30: note: expanded from macro 'PFX'
#define PFX(stack_pagealign)(func, align) func()
^
/wrkdirs/usr/ports/multimedia/x265/work/x265_3.2.1/source/test/ipfilterharness.cpp:727:13: error: use of undeclared identifier 'align'; did you mean 'std::align'?
/wrkdirs/usr/ports/multimedia/x265/work/x265_3.2.1/source/test/testharness.h:123:9: note: expanded from macro 'REPORT_SPEEDUP'
x265_emms(); \
^
/wrkdirs/usr/ports/multimedia/x265/work/x265_3.2.1/source/common/cpu.h:46:21: note: expanded from macro 'x265_emms'
#define x265_emms() PFX(cpu_emms)()
^
/wrkdirs/usr/ports/multimedia/x265/work/x265_3.2.1/source/test/testharness.h:139:36: note: expanded from macro 'PFX'
#define PFX(stack_pagealign)(func, align) func()
^
/usr/include/c++/v1/memory:5596:24: note: 'std::align' declared here
_LIBCPP_FUNC_VIS void* align(size_t __align, size_t __sz, void*& __ptr, size_t& __space);
^
/wrkdirs/usr/ports/multimedia/x265/work/x265_3.2.1/source/test/ipfilterharness.cpp:735:13: error: use of undeclared identifier '__rdtsc'
REPORT_SPEEDUP(opt.pu[value].luma_vpp, ref.pu[value].luma_vpp,
^
/wrkdirs/usr/ports/multimedia/x265/work/x265_3.2.1/source/test/testharness.h:104:37: note: expanded from macro 'REPORT_SPEEDUP'
uint32_t t0 = (uint32_t)__rdtsc(); \
^
/wrkdirs/usr/ports/multimedia/x265/work/x265_3.2.1/source/test/ipfilterharness.cpp:735:13: error: use of undeclared identifier '__rdtsc'
/wrkdirs/usr/ports/multimedia/x265/work/x265_3.2.1/source/test/testharness.h:109:37: note: expanded from macro 'REPORT_SPEEDUP'
uint32_t t1 = (uint32_t)__rdtsc() - t0; \
^
/wrkdirs/usr/ports/multimedia/x265/work/x265_3.2.1/source/test/ipfilterharness.cpp:735:13: error: use of undeclared identifier '__rdtsc'
/wrkdirs/usr/ports/multimedia/x265/work/x265_3.2.1/source/test/testharness.h:115:37: note: expanded from macro 'REPORT_SPEEDUP'
uint32_t t0 = (uint32_t)__rdtsc(); \
^
/wrkdirs/usr/ports/multimedia/x265/work/x265_3.2.1/source/test/ipfilterharness.cpp:735:13: error: use of undeclared identifier '__rdtsc'
/wrkdirs/usr/ports/multimedia/x265/work/x265_3.2.1/source/test/testharness.h:120:37: note: expanded from macro 'REPORT_SPEEDUP'
uint32_t t1 = (uint32_t)__rdtsc() - t0; \
^
/wrkdirs/usr/ports/multimedia/x265/work/x265_3.2.1/source/test/ipfilterharness.cpp:735:13: error: use of undeclared identifier 'func'
/wrkdirs/usr/ports/multimedia/x265/work/x265_3.2.1/source/test/testharness.h:123:9: note: expanded from macro 'REPORT_SPEEDUP'
x265_emms(); \
^
/wrkdirs/usr/ports/multimedia/x265/work/x265_3.2.1/source/common/cpu.h:46:21: note: expanded from macro 'x265_emms'
#define x265_emms() PFX(cpu_emms)()
^
/wrkdirs/usr/ports/multimedia/x265/work/x265_3.2.1/source/test/testharness.h:139:30: note: expanded from macro 'PFX'
#define PFX(stack_pagealign)(func, align) func()
^
/wrkdirs/usr/ports/multimedia/x265/work/x265_3.2.1/source/test/ipfilterharness.cpp:735:13: error: use of undeclared identifier 'align'; did you mean 'std::align'?
/wrkdirs/usr/ports/multimedia/x265/work/x265_3.2.1/source/test/testharness.h:123:9: note: expanded from macro 'REPORT_SPEEDUP'
x265_emms(); \
^
/wrkdirs/usr/ports/multimedia/x265/work/x265_3.2.1/source/common/cpu.h:46:21: note: expanded from macro 'x265_emms'
#define x265_emms() PFX(cpu_emms)()
^
/wrkdirs/usr/ports/multimedia/x265/work/x265_3.2.1/source/test/testharness.h:139:36: note: expanded from macro 'PFX'
#define PFX(stack_pagealign)(func, align) func()
^
/usr/include/c++/v1/memory:5596:24: note: 'std::align' declared here
_LIBCPP_FUNC_VIS void* align(size_t __align, size_t __sz, void*& __ptr, size_t& __space);
^
/wrkdirs/usr/ports/multimedia/x265/work/x265_3.2.1/source/test/ipfilterharness.cpp:743:13: error: use of undeclared identifier '__rdtsc'
REPORT_SPEEDUP(opt.pu[value].luma_vps, ref.pu[value].luma_vps,
^
/wrkdirs/usr/ports/multimedia/x265/work/x265_3.2.1/source/test/testharness.h:104:37: note: expanded from macro 'REPORT_SPEEDUP'
uint32_t t0 = (uint32_t)__rdtsc(); \
^
fatal error: too many errors emitted, stopping now [-ferror-limit=]
1 warning and 20 errors generated.
[25/74] /nxb-bin/usr/bin/c++ -DENABLE_HDR10_PLUS -DEXPORT_C_API=1 -DHAVE_INT_TYPES_H=1 -DHIGH_BIT_DEPTH=0 -DX265_DEPTH=8 -DX265_NS=x265 -D__STDC_LIMIT_MACROS=1 -I/wrkdirs/usr/ports/multimedia/x265/work/x265_3.2.1/source/. -I/wrkdirs/usr/ports/multimedia/x265/work/x265_3.2.1/source/dynamicHDR10 -I. -I/wrkdirs/usr/ports/multimedia/x265/work/x265_3.2.1/source/common -I/wrkdirs/usr/ports/multimedia/x265/work/x265_3.2.1/source/encoder -O2 -pipe -DNDEBUG -O3 -fstack-protector-strong -fno-strict-aliasing -O2 -pipe -DNDEBUG -O3 -fstack-protector-strong -fno-strict-aliasing -Wall -Wextra -Wshadow -std=gnu++11 -fPIC -Wno-array-bounds -ffast-math -mstackrealign -fno-exceptions -MD -MT test/CMakeFiles/TestBench.dir/intrapredharness.cpp.o -MF test/CMakeFiles/TestBench.dir/intrapredharness.cpp.o.d -o test/CMakeFiles/TestBench.dir/intrapredharness.cpp.o -c /wrkdirs/usr/ports/multimedia/x265/work/x265_3.2.1/source/test/intrapredharness.cpp
FAILED: test/CMakeFiles/TestBench.dir/intrapredharness.cpp.o
/nxb-bin/usr/bin/c++ -DENABLE_HDR10_PLUS -DEXPORT_C_API=1 -DHAVE_INT_TYPES_H=1 -DHIGH_BIT_DEPTH=0 -DX265_DEPTH=8 -DX265_NS=x265 -D__STDC_LIMIT_MACROS=1 -I/wrkdirs/usr/ports/multimedia/x265/work/x265_3.2.1/source/. -I/wrkdirs/usr/ports/multimedia/x265/work/x265_3.2.1/source/dynamicHDR10 -I. -I/wrkdirs/usr/ports/multimedia/x265/work/x265_3.2.1/source/common -I/wrkdirs/usr/ports/multimedia/x265/work/x265_3.2.1/source/encoder -O2 -pipe -DNDEBUG -O3 -fstack-protector-strong -fno-strict-aliasing -O2 -pipe -DNDEBUG -O3 -fstack-protector-strong -fno-strict-aliasing -Wall -Wextra -Wshadow -std=gnu++11 -fPIC -Wno-array-bounds -ffast-math -mstackrealign -fno-exceptions -MD -MT test/CMakeFiles/TestBench.dir/intrapredharness.cpp.o -MF test/CMakeFiles/TestBench.dir/intrapredharness.cpp.o.d -o test/CMakeFiles/TestBench.dir/intrapredharness.cpp.o -c /wrkdirs/usr/ports/multimedia/x265/work/x265_3.2.1/source/test/intrapredharness.cpp
In file included from /wrkdirs/usr/ports/multimedia/x265/work/x265_3.2.1/source/test/intrapredharness.cpp:26:
In file included from /wrkdirs/usr/ports/multimedia/x265/work/x265_3.2.1/source/test/intrapredharness.h:27:
/wrkdirs/usr/ports/multimedia/x265/work/x265_3.2.1/source/test/testharness.h:139:9: warning: 'PFX' macro redefined [-Wmacro-redefined]
#define PFX(stack_pagealign)(func, align) func()
^
/wrkdirs/usr/ports/multimedia/x265/work/x265_3.2.1/source/common/cpu.h:32:9: note: previous definition is here
#define PFX(name) PFX2(X265_NS, name)
^
/wrkdirs/usr/ports/multimedia/x265/work/x265_3.2.1/source/test/intrapredharness.cpp:273:13: error: use of undeclared identifier '__rdtsc'
REPORT_SPEEDUP(opt.cu[i].intra_pred[PLANAR_IDX], ref.cu[i].intra_pred[PLANAR_IDX],
^
/wrkdirs/usr/ports/multimedia/x265/work/x265_3.2.1/source/test/testharness.h:104:37: note: expanded from macro 'REPORT_SPEEDUP'
uint32_t t0 = (uint32_t)__rdtsc(); \
^
/wrkdirs/usr/ports/multimedia/x265/work/x265_3.2.1/source/test/intrapredharness.cpp:273:13: error: use of undeclared identifier '__rdtsc'
/wrkdirs/usr/ports/multimedia/x265/work/x265_3.2.1/source/test/testharness.h:109:37: note: expanded from macro 'REPORT_SPEEDUP'
uint32_t t1 = (uint32_t)__rdtsc() - t0; \
^
/wrkdirs/usr/ports/multimedia/x265/work/x265_3.2.1/source/test/intrapredharness.cpp:273:13: error: use of undeclared identifier '__rdtsc'
/wrkdirs/usr/ports/multimedia/x265/work/x265_3.2.1/source/test/testharness.h:115:37: note: expanded from macro 'REPORT_SPEEDUP'
uint32_t t0 = (uint32_t)__rdtsc(); \
^
/wrkdirs/usr/ports/multimedia/x265/work/x265_3.2.1/source/test/intrapredharness.cpp:273:13: error: use of undeclared identifier '__rdtsc'
/wrkdirs/usr/ports/multimedia/x265/work/x265_3.2.1/source/test/testharness.h:120:37: note: expanded from macro 'REPORT_SPEEDUP'
uint32_t t1 = (uint32_t)__rdtsc() - t0; \
^
/wrkdirs/usr/ports/multimedia/x265/work/x265_3.2.1/source/test/intrapredharness.cpp:273:13: error: use of undeclared identifier 'func'
/wrkdirs/usr/ports/multimedia/x265/work/x265_3.2.1/source/test/testharness.h:123:9: note: expanded from macro 'REPORT_SPEEDUP'
x265_emms(); \
^
/wrkdirs/usr/ports/multimedia/x265/work/x265_3.2.1/source/common/cpu.h:46:21: note: expanded from macro 'x265_emms'
#define x265_emms() PFX(cpu_emms)()
^
/wrkdirs/usr/ports/multimedia/x265/work/x265_3.2.1/source/test/testharness.h:139:30: note: expanded from macro 'PFX'
#define PFX(stack_pagealign)(func, align) func()
^
/wrkdirs/usr/ports/multimedia/x265/work/x265_3.2.1/source/test/intrapredharness.cpp:273:13: error: use of undeclared identifier 'align'; did you mean 'std::align'?
/wrkdirs/usr/ports/multimedia/x265/work/x265_3.2.1/source/test/testharness.h:123:9: note: expanded from macro 'REPORT_SPEEDUP'
x265_emms(); \
^
/wrkdirs/usr/ports/multimedia/x265/work/x265_3.2.1/source/common/cpu.h:46:21: note: expanded from macro 'x265_emms'
#define x265_emms() PFX(cpu_emms)()
^
/wrkdirs/usr/ports/multimedia/x265/work/x265_3.2.1/source/test/testharness.h:139:36: note: expanded from macro 'PFX'
#define PFX(stack_pagealign)(func, align) func()
^
/usr/include/c++/v1/memory:5596:24: note: 'std::align' declared here
_LIBCPP_FUNC_VIS void* align(size_t __align, size_t __sz, void*& __ptr, size_t& __space);
^
/wrkdirs/usr/ports/multimedia/x265/work/x265_3.2.1/source/test/intrapredharness.cpp:279:13: error: use of undeclared identifier '__rdtsc'
REPORT_SPEEDUP(opt.cu[i].intra_pred[DC_IDX], ref.cu[i].intra_pred[DC_IDX],
^
/wrkdirs/usr/ports/multimedia/x265/work/x265_3.2.1/source/test/testharness.h:104:37: note: expanded from macro 'REPORT_SPEEDUP'
uint32_t t0 = (uint32_t)__rdtsc(); \
^
/wrkdirs/usr/ports/multimedia/x265/work/x265_3.2.1/source/test/intrapredharness.cpp:279:13: error: use of undeclared identifier '__rdtsc'
/wrkdirs/usr/ports/multimedia/x265/work/x265_3.2.1/source/test/testharness.h:109:37: note: expanded from macro 'REPORT_SPEEDUP'
uint32_t t1 = (uint32_t)__rdtsc() - t0; \
^
/wrkdirs/usr/ports/multimedia/x265/work/x265_3.2.1/source/test/intrapredharness.cpp:279:13: error: use of undeclared identifier '__rdtsc'
/wrkdirs/usr/ports/multimedia/x265/work/x265_3.2.1/source/test/testharness.h:115:37: note: expanded from macro 'REPORT_SPEEDUP'
uint32_t t0 = (uint32_t)__rdtsc(); \
^
/wrkdirs/usr/ports/multimedia/x265/work/x265_3.2.1/source/test/intrapredharness.cpp:279:13: error: use of undeclared identifier '__rdtsc'
/wrkdirs/usr/ports/multimedia/x265/work/x265_3.2.1/source/test/testharness.h:120:37: note: expanded from macro 'REPORT_SPEEDUP'
uint32_t t1 = (uint32_t)__rdtsc() - t0; \
^
/wrkdirs/usr/ports/multimedia/x265/work/x265_3.2.1/source/test/intrapredharness.cpp:279:13: error: use of undeclared identifier 'func'
/wrkdirs/usr/ports/multimedia/x265/work/x265_3.2.1/source/test/testharness.h:123:9: note: expanded from macro 'REPORT_SPEEDUP'
x265_emms(); \
^
/wrkdirs/usr/ports/multimedia/x265/work/x265_3.2.1/source/common/cpu.h:46:21: note: expanded from macro 'x265_emms'
#define x265_emms() PFX(cpu_emms)()
^
/wrkdirs/usr/ports/multimedia/x265/work/x265_3.2.1/source/test/testharness.h:139:30: note: expanded from macro 'PFX'
#define PFX(stack_pagealign)(func, align) func()
^
/wrkdirs/usr/ports/multimedia/x265/work/x265_3.2.1/source/test/intrapredharness.cpp:279:13: error: use of undeclared identifier 'align'; did you mean 'std::align'?
/wrkdirs/usr/ports/multimedia/x265/work/x265_3.2.1/source/test/testharness.h:123:9: note: expanded from macro 'REPORT_SPEEDUP'
x265_emms(); \
^
/wrkdirs/usr/ports/multimedia/x265/work/x265_3.2.1/source/common/cpu.h:46:21: note: expanded from macro 'x265_emms'
#define x265_emms() PFX(cpu_emms)()
^
/wrkdirs/usr/ports/multimedia/x265/work/x265_3.2.1/source/test/testharness.h:139:36: note: expanded from macro 'PFX'
#define PFX(stack_pagealign)(func, align) func()
^
/usr/include/c++/v1/memory:5596:24: note: 'std::align' declared here
_LIBCPP_FUNC_VIS void* align(size_t __align, size_t __sz, void*& __ptr, size_t& __space);
^
/wrkdirs/usr/ports/multimedia/x265/work/x265_3.2.1/source/test/intrapredharness.cpp:284:17: error: use of undeclared identifier '__rdtsc'
REPORT_SPEEDUP(opt.cu[i].intra_pred[DC_IDX], ref.cu[i].intra_pred[DC_IDX],
^
/wrkdirs/usr/ports/multimedia/x265/work/x265_3.2.1/source/test/testharness.h:104:37: note: expanded from macro 'REPORT_SPEEDUP'
uint32_t t0 = (uint32_t)__rdtsc(); \
^
/wrkdirs/usr/ports/multimedia/x265/work/x265_3.2.1/source/test/intrapredharness.cpp:284:17: error: use of undeclared identifier '__rdtsc'
/wrkdirs/usr/ports/multimedia/x265/work/x265_3.2.1/source/test/testharness.h:109:37: note: expanded from macro 'REPORT_SPEEDUP'
uint32_t t1 = (uint32_t)__rdtsc() - t0; \
^
/wrkdirs/usr/ports/multimedia/x265/work/x265_3.2.1/source/test/intrapredharness.cpp:284:17: error: use of undeclared identifier '__rdtsc'
/wrkdirs/usr/ports/multimedia/x265/work/x265_3.2.1/source/test/testharness.h:115:37: note: expanded from macro 'REPORT_SPEEDUP'
uint32_t t0 = (uint32_t)__rdtsc(); \
^
/wrkdirs/usr/ports/multimedia/x265/work/x265_3.2.1/source/test/intrapredharness.cpp:284:17: error: use of undeclared identifier '__rdtsc'
/wrkdirs/usr/ports/multimedia/x265/work/x265_3.2.1/source/test/testharness.h:120:37: note: expanded from macro 'REPORT_SPEEDUP'
uint32_t t1 = (uint32_t)__rdtsc() - t0; \
^
/wrkdirs/usr/ports/multimedia/x265/work/x265_3.2.1/source/test/intrapredharness.cpp:284:17: error: use of undeclared identifier 'func'
/wrkdirs/usr/ports/multimedia/x265/work/x265_3.2.1/source/test/testharness.h:123:9: note: expanded from macro 'REPORT_SPEEDUP'
x265_emms(); \
^
/wrkdirs/usr/ports/multimedia/x265/work/x265_3.2.1/source/common/cpu.h:46:21: note: expanded from macro 'x265_emms'
#define x265_emms() PFX(cpu_emms)()
^
/wrkdirs/usr/ports/multimedia/x265/work/x265_3.2.1/source/test/testharness.h:139:30: note: expanded from macro 'PFX'
#define PFX(stack_pagealign)(func, align) func()
^
/wrkdirs/usr/ports/multimedia/x265/work/x265_3.2.1/source/test/intrapredharness.cpp:284:17: error: use of undeclared identifier 'align'; did you mean 'std::align'?
/wrkdirs/usr/ports/multimedia/x265/work/x265_3.2.1/source/test/testharness.h:123:9: note: expanded from macro 'REPORT_SPEEDUP'
x265_emms(); \
^
/wrkdirs/usr/ports/multimedia/x265/work/x265_3.2.1/source/common/cpu.h:46:21: note: expanded from macro 'x265_emms'
#define x265_emms() PFX(cpu_emms)()
^
/wrkdirs/usr/ports/multimedia/x265/work/x265_3.2.1/source/test/testharness.h:139:36: note: expanded from macro 'PFX'
#define PFX(stack_pagealign)(func, align) func()
^
/usr/include/c++/v1/memory:5596:24: note: 'std::align' declared here
_LIBCPP_FUNC_VIS void* align(size_t __align, size_t __sz, void*& __ptr, size_t& __space);
^
/wrkdirs/usr/ports/multimedia/x265/work/x265_3.2.1/source/test/intrapredharness.cpp:295:13: error: use of undeclared identifier '__rdtsc'
REPORT_SPEEDUP(opt.cu[i].intra_pred_allangs, ref.cu[i].intra_pred_allangs,
^
/wrkdirs/usr/ports/multimedia/x265/work/x265_3.2.1/source/test/testharness.h:104:37: note: expanded from macro 'REPORT_SPEEDUP'
uint32_t t0 = (uint32_t)__rdtsc(); \
^
fatal error: too many errors emitted, stopping now [-ferror-limit=]
1 warning and 20 errors generated.
[26/74] /nxb-bin/usr/bin/c++ -DHAVE_INT_TYPES_H=1 -DHIGH_BIT_DEPTH=0 -DX265_DEPTH=8 -D__STDC_LIMIT_MACROS=1 -I/wrkdirs/usr/ports/multimedia/x265/work/x265_3.2.1/source/. -I/wrkdirs/usr/ports/multimedia/x265/work/x265_3.2.1/source/dynamicHDR10 -I. -O2 -pipe -DNDEBUG -O3 -fstack-protector-strong -fno-strict-aliasing -O2 -pipe -DNDEBUG -O3 -fstack-protector-strong -fno-strict-aliasing -Wall -Wextra -Wshadow -std=gnu++11 -fPIC -Wno-array-bounds -ffast-math -mstackrealign -fno-exceptions -Wall -Wextra -Wshadow -std=c++11 -fPIC -Wno-array-bounds -ffast-math -mstackrealign -fno-exceptions -MD -MT dynamicHDR10/CMakeFiles/dynamicHDR10.dir/SeiMetadataDictionary.cpp.o -MF dynamicHDR10/CMakeFiles/dynamicHDR10.dir/SeiMetadataDictionary.cpp.o.d -o dynamicHDR10/CMakeFiles/dynamicHDR10.dir/SeiMetadataDictionary.cpp.o -c /wrkdirs/usr/ports/multimedia/x265/work/x265_3.2.1/source/dynamicHDR10/SeiMetadataDictionary.cpp
[27/74] /nxb-bin/usr/bin/c++ -DHAVE_INT_TYPES_H=1 -DHIGH_BIT_DEPTH=0 -DX265_DEPTH=8 -D__STDC_LIMIT_MACROS=1 -I/wrkdirs/usr/ports/multimedia/x265/work/x265_3.2.1/source/. -I/wrkdirs/usr/ports/multimedia/x265/work/x265_3.2.1/source/dynamicHDR10 -I. -O2 -pipe -DNDEBUG -O3 -fstack-protector-strong -fno-strict-aliasing -O2 -pipe -DNDEBUG -O3 -fstack-protector-strong -fno-strict-aliasing -Wall -Wextra -Wshadow -std=gnu++11 -fPIC -Wno-array-bounds -ffast-math -mstackrealign -fno-exceptions -Wall -Wextra -Wshadow -std=c++11 -fPIC -Wno-array-bounds -ffast-math -mstackrealign -fno-exceptions -MD -MT dynamicHDR10/CMakeFiles/dynamicHDR10.dir/api.cpp.o -MF dynamicHDR10/CMakeFiles/dynamicHDR10.dir/api.cpp.o.d -o dynamicHDR10/CMakeFiles/dynamicHDR10.dir/api.cpp.o -c /wrkdirs/usr/ports/multimedia/x265/work/x265_3.2.1/source/dynamicHDR10/api.cpp
[28/74] /nxb-bin/usr/bin/c++ -DENABLE_HDR10_PLUS -DEXPORT_C_API=1 -DHAVE_INT_TYPES_H=1 -DHIGH_BIT_DEPTH=0 -DX265_DEPTH=8 -DX265_NS=x265 -D__STDC_LIMIT_MACROS=1 -I/wrkdirs/usr/ports/multimedia/x265/work/x265_3.2.1/source/. -I/wrkdirs/usr/ports/multimedia/x265/work/x265_3.2.1/source/dynamicHDR10 -I. -I/wrkdirs/usr/ports/multimedia/x265/work/x265_3.2.1/source/common -I/wrkdirs/usr/ports/multimedia/x265/work/x265_3.2.1/source/encoder -O2 -pipe -DNDEBUG -O3 -fstack-protector-strong -fno-strict-aliasing -O2 -pipe -DNDEBUG -O3 -fstack-protector-strong -fno-strict-aliasing -Wall -Wextra -Wshadow -std=gnu++11 -fPIC -Wno-array-bounds -ffast-math -mstackrealign -fno-exceptions -MD -MT common/CMakeFiles/common.dir/quant.cpp.o -MF common/CMakeFiles/common.dir/quant.cpp.o.d -o common/CMakeFiles/common.dir/quant.cpp.o -c /wrkdirs/usr/ports/multimedia/x265/work/x265_3.2.1/source/common/quant.cpp
ninja: build stopped: subcommand failed.
===> Compilation failed unexpectedly.
Try to set MAKE_JOBS_UNSAFE=yes and rebuild before reporting the failure to
the maintainer.
*** Error code 1
Stop.
make: stopped in /usr/ports/multimedia/x265
=>> Cleaning up wrkdir
===> Cleaning for x265-3.2.1_1
build of multimedia/x265 | x265-3.2.1_1 ended at Fri Feb 7 09:56:53 -04 2020
build time: 00:00:24
!!! build failure encountered !!!

Event Timeline

jbeich changed the title of this paste from untitled to multimedia/x265: built on 12.1 armv6.