Page MenuHomeFreeBSD
Paste P347

(An Untitled Masterwork)
ArchivedPublic

Authored by antranigv_freebsd.am on Dec 20 2019, 1:09 AM.
root@dellbsd:/usr/ports/lang/voc # make
===> License GPLv3 accepted by the user
===> voc-2.1.0 depends on file: /usr/local/sbin/pkg - found
===> Fetching all distfiles required by voc-2.1.0 for building
===> Extracting for voc-2.1.0
=> SHA256 Checksum OK for vishaps-voc-2.1.0_GH0.tar.gz.
===> Patching for voc-2.1.0
===> Configuring for voc-2.1.0
===> Building for voc-2.1.0
--- configuration ---
Configuration: 2.1.0 [2019/12/20] for clang LP64 on freebsd
fatal: not a git repository (or any parent up to mount point /usr)
Stopping at filesystem boundary (GIT_DISCOVERY_ACROSS_FILESYSTEM not set).
fatal: not a git repository (or any parent up to mount point /usr)
Stopping at filesystem boundary (GIT_DISCOVERY_ACROSS_FILESYSTEM not set).
Branch: .
--- full ---
--- Cleaning branch freebsd clang LP64 ---
--- Compiler build started ---
Populating clean build directory from bootstrap C sources unix-88.
make assemble - compiling Oberon compiler c source:
VERSION: 2.1.0
BRANCH:
Target characteristics:
PLATFORM: unix
OS: freebsd
BUILDDIR: build/freebsd.LP64.clang
INSTALLDIR: /usr/local/share/voc
Oberon characteristics:
MODEL: 2
ADRSIZE: 8
ALIGNMENT: 8
C compiler:
COMPILER: clang
COMPILE: clang -fPIC -g
DATAMODEL: LP64
cd: build/freebsd.LP64.clang: No such file or directory
cd: build/freebsd.LP64.clang: No such file or directory
cd: build/freebsd.LP64.clang: No such file or directory
cd: build/freebsd.LP64.clang: No such file or directory
cd: build/freebsd.LP64.clang: No such file or directory
cp: src/runtime/*.[ch]: No such file or directory
--- assemble ---
*** [assemble] Error code 1
make[3]: stopped in /usr/ports/lang/voc/work/voc-2.1.0
1 error
make[3]: stopped in /usr/ports/lang/voc/work/voc-2.1.0
--- compilerfromsavedsource ---
*** [compilerfromsavedsource] Error code 2
make[2]: stopped in /usr/ports/lang/voc/work/voc-2.1.0
1 error
make[2]: stopped in /usr/ports/lang/voc/work/voc-2.1.0
*** [full] Error code 2
make[1]: stopped in /usr/ports/lang/voc/work/voc-2.1.0
1 error
make[1]: stopped in /usr/ports/lang/voc/work/voc-2.1.0
===> Compilation failed unexpectedly.
Try to set MAKE_JOBS_UNSAFE=yes and rebuild before reporting the failure to
the maintainer.
*** Error code 1
Stop.
make: stopped in /usr/ports/lang/voc